rlib/test/test_rawstorage.py::TestCBackend::()::test_backend_float_unaligned
self = <rpython.rlib.test.test_rawstorage.TestCBackend object at 0x000000000da0e838>
monkeypatch = <_pytest.monkeypatch.monkeypatch instance at 0x000000000d9e5f60>
def test_backend_float_unaligned(self, monkeypatch):
def f(v):
r = alloc_raw_storage(24)
raw_storage_setitem_unaligned(r, 3, v)
res = raw_storage_getitem_unaligned(lltype.Float, r, 3)
free_raw_storage(r)
return res != v
if monkeypatch is not None:
monkeypatch.setattr(rawstorage, 'misaligned_is_fine', False)
> fc = compile(f, [float])
rlib/test/test_rawstorage.py:85:
_ _ _ _ _ _ _ _ _ _ _ _ _ _ _ _ _ _ _ _ _ _ _ _ _ _ _ _ _ _ _ _ _ _ _ _ _ _ _ _
translator/c/test/test_genc.py:124: in compile
t.compile_c()
translator/interactive.py:123: in compile_c
self.driver.compile_c()
translator/driver.py:108: in proc
return self.proceed(backend_goal)
translator/driver.py:569: in proceed
result = self._execute(goals, task_skip = self._maybe_skip())
translator/tool/taskengine.py:114: in _execute
res = self._do(goal, taskcallable, *args, **kwds)
translator/driver.py:278: in _do
res = func()
translator/driver.py:536: in task_compile_c
cbuilder.compile(**kwds)
translator/c/genc.py:341: in compile
extra_opts)
translator/platform/posix.py:280: in execute_makefile
self._handle_error(returncode, stdout, stderr, path.join('make'))
_ _ _ _ _ _ _ _ _ _ _ _ _ _ _ _ _ _ _ _ _ _ _ _ _ _ _ _ _ _ _ _ _ _ _ _ _ _ _ _
self = <Linux cc=gcc>, returncode = 2
stdout = "make: Entering directory '/tmp/pytest/usession-main-3196/testing_2'\ngcc -O3 -pthread -fomit-frame-pointer -Wall -Wno...ib -lutil -lrt -pthread -Wl,--export-dynamic \nmake: Leaving directory '/tmp/pytest/usession-main-3196/testing_2'\n"
stderr = 'collect2: fatal error: posix_spawnp: Operation not permitted\ncompilation terminated.\nmake: *** [Makefile:118: testing_2] Error 1\n'
outname = local('/tmp/pytest/usession-main-3196/testing_2/make')
def _handle_error(self, returncode, stdout, stderr, outname):
if returncode != 0:
errorfile = outname.new(ext='errors')
errorfile.write(stderr, 'wb')
if self.log_errors:
stderrlines = stderr.splitlines()
for line in stderrlines:
log.Error(line)
# ^^^ don't use ERROR, because it might actually be fine.
# Also, ERROR confuses lib-python/conftest.py.
> raise CompilationError(stdout, stderr)
E CompilationError: CompilationError(err="""
E collect2: fatal error: posix_spawnp: Operation not permitted
E compilation terminated.
E make: *** [Makefile:118: testing_2] Error 1
E """)
translator/platform/__init__.py:155: CompilationError
---------- Captured stderr call ----------
[flowgraph] (rpython.translator.c.test.test_genc:66)entry_point
[translation:info] Annotating&simplifying...
[translation:info] with policy: rpython.annotator.policy.AnnotatorPolicy
[flowgraph] (rpython.rlib.test.test_rawstorage:76)f
[flowgraph] (rpython.rlib.rawstorage:12)alloc_raw_storage
[flowgraph] (rpython.rlib.rawstorage:101)raw_storage_setitem_unaligned
[flowgraph] (rpython.rtyper.lltypesystem.lltype:2296)scoped_alloc
[flowgraph] (rpython.rtyper.lltypesystem.lltype:2280)ScopedAlloc_Array of Float {'nolength': True} .__init__
[flowgraph] (rpython.rtyper.lltypesystem.lltype:2286)ScopedAlloc_Array of Float {'nolength': True} .__enter__
[flowgraph] (rpython.rlib.rawstorage:81)raw_storage_getitem_unaligned
[flowgraph] (rpython.rtyper.lltypesystem.lltype:2289)ScopedAlloc_Array of Float {'nolength': True} .__exit__
[flowgraph] (rpython.rtyper.lltypesystem.rffi:278)memcpy
[flowgraph] (rpython.rlib.rawstorage:39)free_raw_storage
[flowgraph] (rpython.flowspace.specialcase:76)rpython_print_item
[flowgraph] (rpython.translator.c.test.test_genc:39)llrepr_out
[flowgraph] (rpython.flowspace.specialcase:95)rpython_print_newline
[flowgraph] (rpython.flowspace.specialcase:85)rpython_print_end
[flowgraph] (rpython.rlib.rposix:500)write
[flowgraph] (rpython.rtyper.lltypesystem.rffi:1448)scoped_nonmovingbuffer.__init__
[flowgraph] (rpython.rtyper.lltypesystem.rffi:1452)scoped_nonmovingbuffer.__enter__
[flowgraph] (rpython.rtyper.lltypesystem.rffi:881)get_nonmovingbuffer_ll
[flowgraph] (rpython.rlib.objectmodel:315)we_are_translated_to_c
[flowgraph] (rpython.rtyper.lltypesystem.rstr:116)copy_string_to_raw
[flowgraph] (rpython.rtyper.lltypesystem.rstr:63)_get_raw_buf
[flowgraph] (rpython.rtyper.lltypesystem.rstr:57)_str_ofs
[flowgraph] (rpython.rtyper.lltypesystem.llmemory:411)sizeof
[flowgraph] (rpython.rtyper.lltypesystem.rffi:278)write
[flowgraph] (rpython.rtyper.lltypesystem.rffi:1454)scoped_nonmovingbuffer.__exit__
[flowgraph] (rpython.rtyper.lltypesystem.rffi:945)free_nonmovingbuffer_ll
[flowgraph] (rpython.rtyper.lltypesystem.rffi:3)ccall_write
[flowgraph] (rpython.rlib.rgil:160)release
[flowgraph] (rpython.rlib.rposix:151)_errno_before
[flowgraph] (rpython.rlib.rthread:349)getraw
[flowgraph] (rpython.rlib.rthread:349)getraw
[flowgraph] (rpython.rlib.rposix:170)_errno_after
[flowgraph] (rpython.rlib.rthread:364)setraw
[flowgraph] (rpython.rlib.rthread:364)setraw
[flowgraph] (rpython.rlib.rgil:171)acquire
[flowgraph] (rpython.rlib.rthread:282)gc_thread_run
[flowgraph] (rpython.rlib.rposix:430)handle_posix_error
[flowgraph] (rpython.rlib.rarithmetic:139)widen
[flowgraph] (rpython.rlib.rposix:113)get_saved_errno
[flowgraph] (?:1)memo__get_alignment_mask_0
[flowgraph] (?:1)memo_CArray_0
[flowgraph] (?:1)memo__make_scoped_allocator_0
[flowgraph] (?:1)memo_CArrayPtr_0
[flowgraph] (?:1)memo_sizeof_0
[flowgraph] (?:1)memo__isfunctype_0
[flowgraph] (?:1)memo__isfunctype_0
[flowgraph] (?:1)memo_offsetof_0
[flowgraph] (?:1)memo_itemoffsetof_0
[flowgraph] (?:1)memo__sizeof_none_0
[flowgraph] (?:1)memo_itemoffsetof_0
[flowgraph] (?:1)memo__isfunctype_0
[flowgraph] (?:1)memo__should_widen_type_0
[translation:info] usession directory: /tmp/pytest/usession-main-3196
[translation:info] already done: Annotating&simplifying
[translation:info] RTyping...
[flowgraph] (rpython.rtyper.rclass:1177)ll_runtime_type_info
[flowgraph] (rpython.rtyper.rlist:690)ll_getitem_nonneg
[flowgraph] (rpython.rtyper.rlist:719)ll_getitem_fast
[flowgraph] (rpython.rtyper.lltypesystem.rlist:372)ll_getitem_fast
[flowgraph] (rpython.rtyper.lltypesystem.rlist:369)ll_items
[flowgraph] (rpython.rtyper.lltypesystem.rstr:601)ll_streq
[flowgraph] (rpython.rtyper.rstr:426)ll_str
[flowgraph] (?:1)memo_ll_constant_0
[flowgraph] (rpython.rtyper.rstr:997)ll_float
[flowgraph] (rpython.rlib.rfloat:87)rstring_to_float
[flowgraph] (rpython.rlib.rdtoa:54)strtod
[flowgraph] (rpython.rlib.objectmodel:397)revdb_flag_io_disabled
[flowgraph] (rpython.rtyper.lltypesystem.rffi:934)get_nonmovingbuffer_ll_final_null
[flowgraph] (rpython.rtyper.lltypesystem.rffi:278)_PyPy_dg_strtod
[flowgraph] (?:1)memo__isfunctype_0
[flowgraph] (?:1)memo__isfunctype_0
[flowgraph] (rpython.rtyper.lltypesystem.rstr:1293)ll_striter
[flowgraph] (rpython.rtyper.lltypesystem.rstr:1306)ll_strnext
[flowgraph] (rpython.rtyper.rlist:590)ll_append
[flowgraph] (rpython.rtyper.lltypesystem.rlist:365)ll_length
[flowgraph] (rpython.rtyper.lltypesystem.rlist:280)_ll_list_resize_ge
[flowgraph] (rpython.rlib.jit:269)isconstant
[flowgraph] (rpython.rlib.jit:269)isconstant
[flowgraph] (rpython.rlib.jit:1300)conditional_call
[flowgraph] (?:11)_ll_list_resize_hint_really_look_inside_iff
[flowgraph] (rpython.rtyper.lltypesystem.rlist:198)<lambda>
[flowgraph] (rpython.rlib.jit:269)isconstant
[flowgraph] (rpython.rtyper.lltypesystem.rlist:198)_ll_list_resize_hint_really
[flowgraph] (rpython.rtyper.lltypesystem.rlist:351)_ll_new_empty_item_array
[flowgraph] (?:2)ll_arraycopy
[flowgraph] (rpython.rlib.rgc:362)ll_arraycopy
[flowgraph] (rpython.rlib.rgc:342)copy_item
[flowgraph] (rpython.rlib.jit:269)isconstant
[flowgraph] (?:2)_ll_list_resize_hint_really_trampoline
[flowgraph] (rpython.rtyper.lltypesystem.rlist:198)_ll_list_resize_hint_really
[flowgraph] (rpython.rtyper.lltypesystem.rlist:377)ll_setitem_fast
[flowgraph] (rpython.rtyper.lltypesystem.rlist:369)ll_items
[flowgraph] (?:1)memo__ll_prebuilt_empty_array_0
[flowgraph] (?:1)memo__contains_gcptr_0
[flowgraph] (?:1)memo_itemoffsetof_0
[flowgraph] (rpython.rtyper.rint:149)ll_str
[flowgraph] (rpython.rtyper.lltypesystem.ll_str:13)ll_int2dec
[flowgraph] (rpython.rtyper.lltypesystem.ll_str:7)ll_unsigned
[flowgraph] (?:2)mallocstr
[flowgraph] (rpython.rtyper.lltypesystem.rstr:36)mallocstr
[flowgraph] (?:11)ll_join_chars_look_inside_iff
[flowgraph] (rpython.rtyper.lltypesystem.rstr:821)<lambda>
[flowgraph] (rpython.rlib.jit:269)isconstant
[flowgraph] (rpython.rtyper.lltypesystem.rstr:820)ll_join_chars
[flowgraph] (rpython.rlib.jit:281)isvirtual
[flowgraph] (?:2)ll_join_chars_trampoline
[flowgraph] (rpython.rtyper.lltypesystem.rstr:820)ll_join_chars
[flowgraph] (?:11)ll_listdelslice_startonly_look_inside_iff
[flowgraph] (rpython.rtyper.rlist:914)<lambda>
[flowgraph] (rpython.rlib.jit:269)isconstant
[flowgraph] (rpython.rtyper.rlist:914)ll_listdelslice_startonly
[flowgraph] (rpython.rtyper.rlist:541)ll_null_item
[flowgraph] (rpython.rlib.jit:281)isvirtual
[flowgraph] (rpython.rtyper.lltypesystem.rlist:295)_ll_list_resize_le
[flowgraph] (rpython.rlib.jit:269)isconstant
[flowgraph] (?:2)ll_listdelslice_startonly_trampoline
[flowgraph] (rpython.rtyper.rlist:914)ll_listdelslice_startonly
[flowgraph] (rpython.rlib.jit:269)isconstant
[flowgraph] (rpython.rlib.jit:1300)conditional_call
[flowgraph] (rpython.rtyper.lltypesystem.rstr:350)ll_strlen
[rtyper] specializing: 100 / 466 blocks (21%)
[flowgraph] (?:11)ll_join_strs_look_inside_iff
[flowgraph] (rpython.rtyper.lltypesystem.rstr:785)<lambda>
[flowgraph] (rpython.rlib.jit:294)loop_unrolling_heuristic
[flowgraph] (rpython.rlib.jit:269)isconstant
[flowgraph] (rpython.rtyper.lltypesystem.rstr:783)ll_join_strs
[flowgraph] (rpython.rtyper.lltypesystem.llmemory:1037)cast_any_ptr
[flowgraph] (rpython.rtyper.lltypesystem.rstr:78)copy_string_contents
[flowgraph] (rpython.rlib.jit:281)isvirtual
[flowgraph] (?:2)ll_join_strs_trampoline
[flowgraph] (rpython.rtyper.lltypesystem.rstr:783)ll_join_strs
[rtyper] specializing: 200 / 520 blocks (38%)
[flowgraph] (rpython.rtyper.lltypesystem.rstr:354)ll_stritem_nonneg
[flowgraph] (rpython.rtyper.lltypesystem.rstr:860)ll_stringslice_startstop
[flowgraph] (rpython.rtyper.lltypesystem.rstr:840)_ll_stringslice
[flowgraph] (?:1)memo_emptystrfun_0
[flowgraph] (rpython.rtyper.lltypesystem.ll_str:13)ll_int2dec
[flowgraph] (rpython.rtyper.lltypesystem.ll_str:7)ll_unsigned
[rtyper] specializing: 300 / 555 blocks (54%)
[flowgraph] (rpython.rtyper.rint:434)ll_uint_py_div
[flowgraph] (rpython.rtyper.rint:525)ll_uint_py_mod
[rtyper] specializing: 400 / 559 blocks (71%)
[rtyper] specializing: 500 / 559 blocks (89%)
[rtyper] -=- specialized 559 blocks -=-
[flowgraph] (rpython.rtyper.rclass:1140)ll_issubclass
[flowgraph] (rpython.rtyper.rclass:1137)ll_type
[rtyper] -=- specialized 4 more blocks -=-
[translation:info] usession directory: /tmp/pytest/usession-main-3196
[translation:info] already done: Annotating&simplifying
[translation:info] already done: RTyping
[translation:info] lltype back-end optimisations...
[backendopt:removecasts] removed 1 cast_pointers in _get_raw_buf__rpy_string
[backendopt:removecasts] removed 3 cast_pointers in handle_posix_error__write
[backendopt:removecasts] removed 3 cast_pointers in ll_float__rpy_stringPtr
[backendopt:removecasts] removed 2 cast_pointers in strtod__SomeString
[backendopt:removecasts] removed 1 cast_pointers in ll_strnext__stringiterPtr
[backendopt:removecasts] removed 1 cast_pointers in ll_join_strs__v811___simple_call__function_l
[backendopt:removecasts] removed 1 cast_pointers in copy_string_contents__rpy_stringPtr_rpy_stringPtr_Signed_Signed_Signed
[backendopt:removecasts] removed 1 cast_pointers in ll_join_strs__v814___simple_call__function_l
[backendopt:removecasts] removed 1 cast_pointers in _ll_stringslice__rpy_stringPtr_Signed_Signed
[backendopt:inlining] phase with threshold factor: 32.4
[backendopt:inlining] heuristic: rpython.translator.backendopt.inline.inlining_heuristic
[backendopt:inlining] 0.00 get_nonmovingbuffer_ll
[backendopt:inlining] 0.00 _get_raw_buf__rpy_string
[backendopt:inlining] 0.00 memcpy__arrayPtr_arrayPtr_Signed_star_3
[backendopt:inlining] 0.00 memo_sizeof_0
[backendopt:inlining] 0.00 isconstant__v789___simple_call__function_i
[backendopt:inlining] 0.00 copy_string_contents__rpy_stringPtr_rpy_stringPtr_Signed_Signed_Signed
[backendopt:inlining] 0.00 cast_any_ptr__Ptr_GcStruct_rpy_stringLlT_rpy_stringPtr
[backendopt:inlining] 0.00 scoped_nonmovingbuffer.__enter__
[backendopt:inlining] 0.00 write__Signed_arrayPtr_Signed_star_3
[backendopt:inlining] 0.00 copy_string_to_raw
[backendopt:inlining] 0.00 __exit____star_3
[backendopt:inlining] 0.00 conditional_call__v784___simple_call__function_c_star_3
[backendopt:inlining] 0.00 isconstant__v783___simple_call__function_i
[backendopt:inlining] 0.00 memo__sizeof_none_0
[backendopt:inlining] 0.00 isconstant__v782___simple_call__function_i
[backendopt:inlining] 0.00 ll_getitem_nonneg__dum_nocheckConst_ll_getitem_fastConst_listPtr_Signed
[backendopt:inlining] 0.00 memo_CArrayPtr_0
[backendopt:inlining] 0.00 scoped_nonmovingbuffer.__init__
[backendopt:inlining] 0.00 gc_thread_run
[backendopt:inlining] 0.00 widen__int
[backendopt:inlining] 0.00 isconstant__v787___simple_call__function_i
[backendopt:inlining] 0.00 get_nonmovingbuffer_ll_final_null__SomeString
[backendopt:inlining] 0.00 memo__ll_prebuilt_empty_array_0
[backendopt:inlining] 0.00 ll_getitem_fast__listPtr_Signed
[backendopt:inlining] 0.00 _PyPy_dg_strtod__arrayPtr_arrayPtr_star_2
[backendopt:inlining] 0.00 isconstant__v793___simple_call__function_i
[backendopt:inlining] 0.00 isvirtual__v795___simple_call__function_i
[backendopt:inlining] 0.00 memo_ll_constant_0
[backendopt:inlining] 0.00 isconstant__v799___simple_call__function_i
[backendopt:inlining] 0.00 isvirtual__v801___simple_call__function_i
[backendopt:inlining] 0.00 isconstant__v803___simple_call__function_i
[backendopt:inlining] 0.00 isconstant__v806___simple_call__function_i
[backendopt:inlining] 0.00 conditional_call__v807___simple_call__function_c_star_3
[backendopt:inlining] 0.00 isconstant__v810___simple_call__function_i
[backendopt:inlining] 0.00 isvirtual__v812___simple_call__function_i
[backendopt:inlining] 0.00 memo_emptystrfun_0
[backendopt:inlining] 2.00 ll_strlen__rpy_stringPtr
[backendopt:inlining] 0.00 get_nonmovingbuffer_ll_final_null__SomeString
[backendopt:inlining] 2.00 ll_length__listPtr
[backendopt:inlining] 2.00 ScopedAlloc_Array of Float {'nolength': True} .__enter__
[backendopt:inlining] 2.00 getraw
[backendopt:inlining] 2.00 ll_items__listPtr
[backendopt:inlining] 2.00 ll_uint_py_div__Unsigned_Unsigned
[backendopt:inlining] 2.00 ll_uint_py_mod__Unsigned_Unsigned
[backendopt:inlining] 2.00 alloc_raw_storage__True_False
[backendopt:inlining] 2.00 free_raw_storage__True
[backendopt:inlining] 2.00 getraw
[backendopt:inlining] 2.00 setraw
[backendopt:inlining] 2.00 setraw
[backendopt:inlining] 2.00 ll_items__listPtr
[backendopt:inlining] 2.00 ll_unsigned__Bool
[backendopt:inlining] 2.00 ll_unsigned__Signed
[backendopt:inlining] 4.00 __exit____star_3
[backendopt:inlining] 4.00 copy_item__arrayPtr_arrayPtr_Signed_Signed
[backendopt:inlining] 4.00 ScopedAlloc_Array of Float {'nolength': True} .__init__
[backendopt:inlining] 4.00 ll_stritem_nonneg__rpy_stringPtr_Signed
[backendopt:inlining] 5.00 release
[backendopt:inlining] 6.00 _str_ofs__rpy_string
[backendopt:inlining] 0.00 get_nonmovingbuffer_ll_final_null__SomeString
[backendopt:inlining] 7.00 mallocstr__Signed
[backendopt:inlining] 7.00 llrepr_out__bool
[backendopt:inlining] 7.00 rpython_print_newline
[backendopt:inlining] 4.00 get_saved_errno
[backendopt:inlining] 7.00 rstring_to_float__SomeString
[backendopt:inlining] 7.00 ll_str__BoolR_BoolConst_Bool
[backendopt:inlining] 7.00 ll_listdelslice_startonly_look_inside_iff__listPtr_Signed
[backendopt:inlining] 7.50 mallocstr__Signed
[backendopt:inlining] 9.00 _ll_list_resize_hint_really_look_inside_iff__listPtr_Signed_Bool
[backendopt:inlining] 9.00 ll_join_strs_look_inside_iff__Signed_arrayPtr_Ptr_GcStruct_rpy_stringLlT
[backendopt:inlining] 9.00 ll_join_chars_look_inside_iff__Signed_arrayPtr_Ptr_GcStruct_rpy_stringLlT
[backendopt:inlining] 4.00 ll_str__StringR_Ptr_GcStruct_rpy_strin_rpy_stringPtr
[backendopt:inlining] 7.00 acquire
[backendopt:inlining] 6.00 ll_getitem_fast__listPtr_Signed
[backendopt:inlining] 11.00 ll_arraycopy__arrayPtr_arrayPtr_Signed_Signed_Signed
[backendopt:inlining] 6.00 ll_setitem_fast__listPtr_Signed_Char
[backendopt:inlining] 12.00 ll_striter__rpy_stringPtr
[backendopt:inlining] 10.00 scoped_alloc__array_False
[backendopt:inlining] 13.00 free_nonmovingbuffer_ll
[backendopt:inlining] 9.00 ll_listdelslice_startonly__v800___simple_call__function_l
[backendopt:inlining] 9.00 ll_listdelslice_startonly__v805___simple_call__function_l
[backendopt:inlining] 15.50 ll_strnext__stringiterPtr
[backendopt:inlining] 4.00 loop_unrolling_heuristic__v809___simple_call__function_l
[backendopt:inlining] 18.12 ll_stringslice_startstop__rpy_stringPtr_Signed_Signed
[backendopt:inlining] 21.65 ll_streq__rpy_stringPtr_rpy_stringPtr
[backendopt:inlining] 17.00 ll_append__listPtr_Char
[backendopt:inlining] 19.25 _errno_after__v780___simple_call__function__
[backendopt:inlining] 26.16 ll_join_chars__v794___simple_call__function_l
[backendopt:inlining] 26.16 ll_join_chars__v797___simple_call__function_l
[backendopt:inlining] 27.50 ll_arraycopy__arrayPtr_arrayPtr_Signed_Signed_Signed
[backendopt:inlining] 31.87 _errno_before__v779___simple_call__function__
[backendopt:inlining] 24.00 f
[backendopt:inlining] 31.75 handle_posix_error__write
[backendopt:inlining] inlined 170 callsites.
[backendopt:removecasts] removed 2 cast_pointers in raw_storage_setitem_unaligned__arrayPtr_Signed_Float
[backendopt:removecasts] removed 2 cast_pointers in raw_storage_getitem_unaligned__FloatLlT_arrayPtr_Signed
[backendopt:removecasts] removed 2 cast_pointers in strtod__SomeString
[backendopt:malloc] starting malloc removal
[backendopt:malloc] 1 simple mallocs removed in 'entry_point'
[backendopt:malloc] 1 simple mallocs removed in 'raw_storage_setitem_unaligned__arrayPtr_Signed_Float'
[backendopt:malloc] 1 simple mallocs removed in 'raw_storage_getitem_unaligned__FloatLlT_arrayPtr_Signed'
[backendopt:malloc] 7 simple mallocs removed in 'memcpy__arrayPtr_arrayPtr_Signed_star_3'
[backendopt:malloc] 1 simple mallocs removed in 'rpython_print_item'
[backendopt:malloc] 1 simple mallocs removed in 'rpython_print_end'
[backendopt:malloc] 3 simple mallocs removed in 'write'
[backendopt:malloc] 2 simple mallocs removed in 'scoped_nonmovingbuffer.__init__'
[backendopt:malloc] 7 simple mallocs removed in 'write__Signed_arrayPtr_Signed_star_3'
[backendopt:malloc] 1 simple mallocs removed in 'strtod__SomeString'
[backendopt:malloc] 5 simple mallocs removed in '_PyPy_dg_strtod__arrayPtr_arrayPtr_star_2'
[backendopt:malloc] 1 simple mallocs removed in '_ll_list_resize_ge__listPtr_Signed'
[backendopt:malloc] 1 simple mallocs removed in 'conditional_call__v784___simple_call__function_c_star_3'
[backendopt:malloc] 1 simple mallocs removed in '_ll_list_resize_le__listPtr_Signed'
[backendopt:malloc] 1 simple mallocs removed in 'conditional_call__v807___simple_call__function_c_star_3'
[backendopt:malloc] removed 34 simple mallocs in total
[backendopt:mergeifblocks] starting to merge if blocks
[translation:info] usession directory: /tmp/pytest/usession-main-3196
[translation:info] already done: Annotating&simplifying
[translation:info] already done: RTyping
[translation:info] already done: lltype back-end optimisations
[translation:info] inserting stack checks...
[flowgraph] (rpython.rlib.rstack:42)stack_check
[flowgraph] (rpython.rlib.rstack:67)stack_check_slowpath
[rtyper] -=- specialized 8 more blocks -=-
[translation:info] inserted 0 stack checks.
[translation:info] Creating database for generating c source...
[flowgraph] (rpython.translator.exceptiontransform:100)rpyexc_occurred
[flowgraph] (rpython.translator.exceptiontransform:104)rpyexc_fetch_type
[flowgraph] (rpython.translator.exceptiontransform:107)rpyexc_fetch_value
[flowgraph] (rpython.translator.exceptiontransform:110)rpyexc_clear
[flowgraph] (rpython.translator.exceptiontransform:114)rpyexc_raise
[flowgraph] (rpython.translator.exceptiontransform:128)rpyexc_reraise
[flowgraph] (rpython.translator.exceptiontransform:133)rpyexc_fetch_exception
[flowgraph] (rpython.translator.exceptiontransform:138)rpyexc_restore_exception
[flowgraph] (rpython.translator.exceptiontransform:539)rpyexc_get_exception_addr
[flowgraph] (rpython.translator.exceptiontransform:543)rpyexc_get_exc_value_addr
[flowgraph] (rpython.rtyper.rclass:1180)ll_inst_type
[rtyper] -=- specialized 25 more blocks -=-
[flowgraph] (rpython.memory.gctransform.transform:455)_ll_malloc_fixedsize
[flowgraph] (rpython.memory.gctransform.transform:462)_ll_malloc_fixedsize_zero
[flowgraph] (rpython.memory.gctransform.transform:478)_ll_malloc_varsize_no_length
[flowgraph] (rpython.memory.gctransform.transform:495)ll_malloc_varsize
[flowgraph] (rpython.memory.gctransform.transform:501)_ll_malloc_varsize_no_length_zero
[flowgraph] (rpython.memory.gctransform.transform:455)_ll_malloc_fixedsize
[flowgraph] (rpython.memory.gctransform.transform:455)_ll_malloc_fixedsize
[flowgraph] (rpython.memory.gctransform.transform:478)_ll_malloc_varsize_no_length
[flowgraph] (rpython.memory.gctransform.transform:495)ll_malloc_varsize
[flowgraph] (rpython.memory.gctransform.boehm:58)ll_identityhash
[flowgraph] (rpython.memory.gctransform.transform:469)_ll_compute_size
[flowgraph] (rpython.memory.gctransform.boehm:20)<lambda>
[flowgraph] (rpython.memory.gctransform.boehm:24)<lambda>
[flowgraph] (rpython.memory.gctransform.transform:469)_ll_compute_size
[rtyper] specializing: 600 / 653 blocks (91%)
[rtyper] -=- specialized 57 more blocks -=-
[backendopt:removecasts] removed 1 cast_pointers in _ll_malloc_fixedsize__Signed
[backendopt:removecasts] removed 1 cast_pointers in _ll_malloc_fixedsize_zero__Signed
[backendopt:removecasts] removed 1 cast_pointers in _ll_malloc_varsize_no_length__Signed_Signed_Signed
[backendopt:removecasts] removed 1 cast_pointers in _ll_malloc_varsize_no_length_zero__Signed_Signed_Signed
[backendopt:removecasts] removed 1 cast_pointers in _ll_malloc_fixedsize__Signed
[backendopt:removecasts] removed 1 cast_pointers in _ll_malloc_fixedsize__Signed
[backendopt:removecasts] removed 1 cast_pointers in _ll_malloc_varsize_no_length__Signed_Signed_Signed
[backendopt:removecasts] removed 1 cast_pointers in _ll_compute_size__Signed_Signed_Signed
[backendopt:removecasts] removed 1 cast_pointers in _ll_compute_size__Signed_Signed_Signed
[backendopt:inlining] phase with threshold factor: 32.4
[backendopt:inlining] heuristic: rpython.translator.backendopt.inline.inlining_heuristic
[backendopt:inlining] 0.00 _ll_compute_size__Signed_Signed_Signed
[backendopt:inlining] 0.00 _ll_compute_size__Signed_Signed_Signed
[backendopt:inlining] 2.00 _lambda_
[backendopt:inlining] 2.00 _lambda_
[backendopt:inlining] 16.50 _ll_malloc_varsize_no_length__Signed_Signed_Signed
[backendopt:inlining] 16.50 _ll_malloc_varsize_no_length__Signed_Signed_Signed
[backendopt:inlining] inlined 8 callsites.
[backendopt:malloc] starting malloc removal
[backendopt:malloc] removed 0 simple mallocs in total
[backendopt:mergeifblocks] starting to merge if blocks
[flowgraph] (rpython.translator.c.genc:261)entrypoint_wrapper
[flowgraph] (rpython.rtyper.lltypesystem.rffi:862)charp2str
[flowgraph] (rpython.rtyper.lltypesystem.rffi:1051)charpsize2str
[flowgraph] (rpython.rtyper.lltypesystem.rstr:145)copy_raw_to_string
[flowgraph] (rpython.rtyper.rlist:487)ll_alloc_and_set
[flowgraph] (rpython.rlib.rarithmetic:741)int_force_ge_zero
[flowgraph] (rpython.rtyper.rlist:510)_ll_alloc_and_set_jit
[flowgraph] (rpython.rtyper.rlist:472)_ll_zero_or_null
[flowgraph] (rpython.rtyper.rlist:494)_ll_alloc_and_set_nojit
[flowgraph] (rpython.rtyper.lltypesystem.rlist:324)ll_newlist
[flowgraph] (rpython.rtyper.rlist:522)_ll_alloc_and_clear
[flowgraph] (rpython.rlib.rgc:508)ll_arrayclear
[flowgraph] (rpython.rtyper.lltypesystem.llmemory:411)sizeof
[flowgraph] (?:11)_ll_alloc_and_set_nonnull_look_inside_iff
[flowgraph] (rpython.rtyper.rlist:530)<lambda>
[flowgraph] (rpython.rlib.jit:269)isconstant
[flowgraph] (rpython.rtyper.rlist:530)_ll_alloc_and_set_nonnull
[flowgraph] (rpython.rtyper.lltypesystem.rlist:377)ll_setitem_fast
[flowgraph] (rpython.rlib.rgc:538)ll_arrayfill
[flowgraph] (?:2)_ll_alloc_and_set_nonnull_trampoline
[flowgraph] (rpython.rtyper.rlist:530)_ll_alloc_and_set_nonnull
[flowgraph] (?:1)memo_itemoffsetof_0
[flowgraph] (?:1)memo__sizeof_none_0
[flowgraph] (rpython.rtyper.rlist:728)ll_setitem_nonneg
[rtyper] specializing: 700 / 741 blocks (94%)
[rtyper] -=- specialized 88 more blocks -=-
[rtyper] -=- specialized 0 more blocks -=-
[rtyper] -=- specialized 0 more blocks -=-
[backendopt:inlining] phase with threshold factor: 32.4
[backendopt:inlining] heuristic: rpython.translator.backendopt.inline.inlining_heuristic
[backendopt:inlining] inlined 0 callsites.
[backendopt:malloc] starting malloc removal
[backendopt:malloc] removed 0 simple mallocs in total
[backendopt:mergeifblocks] starting to merge if blocks
[c:database] GC transformer: finished helpers
[c:database] GC transformer: finished tables
[c:database] Inlining GC helpers and postprocessing
[c] 301 nodes [ array: 30 boehm rtti: 17 func: 68 struct: 186 ]
[c:database] Completed
[translation:info] database for generating C source was created
[translation:info] Generating c source...
[c:writing] structdef.h
[c:writing] forwarddecl.h
[c:writing] preimpl.h
[c:writing] data_rpython_flowspace.c
[c:writing] data_rpython_memory_gctransform.c
[c:writing] data_rpython_rlib.c
[c:writing] data_rpython_rtyper_lltypesystem.c
[c:writing] data_rpython_translator_c.c
[c:writing] data_rpython_translator_c_test.c
[c:writing] nonfuncnodes.c
[c:writing] data_rpython_rtyper_lltypesystem_1.c
[c:writing] implement.c
[c:writing] rpython_flowspace.c
[c:writing] rpython_memory_gctransform.c
[c:writing] rpython_rlib.c
[c:writing] rpython_rtyper.c
[c:writing] rpython_rtyper_lltypesystem.c
[c:writing] rpython_translator.c
[c:writing] rpython_translator_c.c
[c:writing] rpython_translator_c_test.c
[translation:info] written: /tmp/pytest/usession-main-3196/testing_2/testing_2.c
[translation:info] Compiling c source...
[platform:execute] make in /tmp/pytest/usession-main-3196/testing_2
[platform:Error] collect2: fatal error: posix_spawnp: Operation not permitted
[platform:Error] compilation terminated.
[platform:Error] make: *** [Makefile:118: testing_2] Error 1
builder: rpython-linux-x86-64 build #948+
test: rlib/test/test_rawstorage.py::TestCBackend::()::test_backend_float_unaligned