pypy ../../rpython/bin/rpython --batch -Ojit targetpypystandalone
in dir /Users/matti/build-worker-x86_64/pypy-c-jit-macos-x86-64/build/pypy/goal (timeout 7200 secs)
watching logfiles {}
argv: ['pypy', '../../rpython/bin/rpython', '--batch', '-Ojit', 'targetpypystandalone']
environment:
HOME=/Users/matti
HOMEBREW_CELLAR=/opt/homebrew_x86_64/Cellar
HOMEBREW_PREFIX=/opt/homebrew_x86_64
HOMEBREW_REPOSITORY=/opt/homebrew_x86_64
INFOPATH=/opt/homebrew_x86_64/share/info:
LANG=en_US.UTF-8
LC_ADDRESS=en_AU.UTF-8
LC_IDENTIFICATION=en_AU.UTF-8
LC_MEASUREMENT=en_AU.UTF-8
LC_MONETARY=en_AU.UTF-8
LC_NAME=en_AU.UTF-8
LC_NUMERIC=en_AU.UTF-8
LC_PAPER=en_AU.UTF-8
LC_TELEPHONE=en_AU.UTF-8
LC_TIME=en_AU.UTF-8
LOGNAME=matti
OLDPWD=/Users/matti
PATH=/Users/matti/oss/pypy-x86_64-buildbot/bin:/opt/homebrew_x86_64/bin:/opt/homebrew_x86_64/sbin:/Library/Frameworks/Python.framework/Versions/3.11/bin:/usr/local/bin:/System/Cryptexes/App/usr/bin:/usr/bin:/bin:/usr/sbin:/sbin:/var/run/com.apple.security.cryptexd/codex.system/bootstrap/usr/local/bin:/var/run/com.apple.security.cryptexd/codex.system/bootstrap/usr/bin:/var/run/com.apple.security.cryptexd/codex.system/bootstrap/usr/appleinternal/bin:/Library/Apple/usr/bin
PKG_CONFIG_PATH=/opt/homebrew_x86_64/opt/openssl@1.1/lib/pkgconfig
PWD=/Users/matti/build-worker-x86_64/pypy-c-jit-macos-x86-64/build/pypy/goal
PYPY_USESSION_DIR=/tmp/buildbot-x86_64
SHELL=/bin/zsh
SHLVL=2
SSH_CLIENT=10.0.0.17 34572 22
SSH_CONNECTION=10.0.0.17 34572 10.0.0.16 22
SSH_TTY=/dev/ttys000
TERM=xterm-256color
TMPDIR=/tmp/buildbot-x86_64
USER=matti
_=/Users/matti/oss/pypy-x86_64-buildbot/bin/buildslave
using PTY: False
[translation:info] 2.7.18 (c7f2b53ceffe, Aug 28 2024, 05:06:55)
[PyPy 7.3.17 with GCC Apple LLVM 15.0.0 (clang-1500.3.9.4)]
[platform:msg] Set platform with 'host' cc=None, using cc='clang', version='Unknown'
[translation:info] Translating target as defined by targetpypystandalone
[translation] PyPy config object:
[translation] [objspace]
[std]
intshortcut = True
optimized_list_getitem = True
withspecialisedtuple = True
[usemodules]
_abc = True
_ast = True
_cffi_backend = True
_codecs = True
_collections = True
_continuation = True
_csv = True
_jitlog = True
_lsprof = True
_md5 = True
_minimal_curses = True
_multibytecodec = True
_multiprocessing = True
_pickle = True
_pickle_support = True
_posixsubprocess = True
_pypyjson = True
_random = True
_rawffi = True
_socket = True
_sre = True
_string = True
_testing = True
_vmprof = True
_weakref = True
array = True
atexit = True
binascii = True
bz2 = True
cmath = True
cpyext = True
errno = True
faulthandler = True
fcntl = True
gc = True
imp = True
marshal = True
math = True
mmap = True
pwd = True
pyexpat = True
pypyjit = True
select = True
signal = True
struct = True
termios = True
thread = True
time = True
token = True
unicodedata = True
zlib = True
[translation] translate.py configuration:
[translation] [translate]
batch = True
opt = jit
targetspec = targetpypystandalone
[translation] translation configuration:
[translation] [translation]
check_str_without_nul = True
continuation = True
gc = incminimark
gcrootfinder = shadowstack
gctransformer = framework
icon = pypy.ico
jit = True
list_comprehension_operations = True
manifest = python.manifest
rawrefcount_link_prefix = True
rpython_translate = True
secondaryentrypoints = cpyext,main
shared = True
thread = True
type_system = lltype
withsmallfuncsets = 5
[translation:info] Annotating&simplifying...
[translation:info] with policy: pypy.tool.ann_override.PyPyAnnotatorPolicy
[translation:info] RTyping...
[rtyper] specializing: 9200 / 183155 blocks (5%)
[rtyper] specializing: 18900 / 188245 blocks (10%)
[rtyper] specializing: 29000 / 192908 blocks (15%)
[rtyper] specializing: 38900 / 194167 blocks (20%)
[rtyper] specializing: 49200 / 196557 blocks (25%)
[rtyper] specializing: 59100 / 196765 blocks (30%)
[rtyper] specializing: 69400 / 198037 blocks (35%)
[rtyper] specializing: 79800 / 199258 blocks (40%)
[rtyper] specializing: 90200 / 200398 blocks (45%)
[rtyper] specializing: 101200 / 202291 blocks (50%)
[rtyper] specializing: 111800 / 203135 blocks (55%)
[rtyper] specializing: 122900 / 204716 blocks (60%)
[rtyper] specializing: 134400 / 206674 blocks (65%)
[rtyper] specializing: 144900 / 206909 blocks (70%)
[rtyper] specializing: 156100 / 208118 blocks (75%)
[rtyper] specializing: 166900 / 208600 blocks (80%)
[rtyper] specializing: 177400 / 208600 blocks (85%)
[rtyper] specializing: 179900 / 208600 blocks (86%)
[rtyper] specializing: 189900 / 208604 blocks (91%)
[rtyper] specializing: 200300 / 208604 blocks (96%)
[rtyper] -=- specialized 208604 blocks -=-
[rtyper] specializing: 208700 / 209402 blocks (99%)
[rtyper] specializing: 209500 / 210135 blocks (99%)
[rtyper] -=- specialized 1531 more blocks -=-
[rtyper] -=- specialized 0 more blocks -=-
[rtyper] -=- specialized 2 more blocks -=-
[translation:info] JIT compiler generation...
[rtyper] -=- specialized 27 more blocks -=-
[rtyper] -=- specialized 4 more blocks -=-
[rtyper] -=- specialized 2 more blocks -=-
[rtyper] -=- specialized 2 more blocks -=-
[rtyper] -=- specialized 2 more blocks -=-
[rtyper] -=- specialized 0 more blocks -=-
[jitcodewriter:WARNING] type LongFloat is too large, ignoring graph
[jitcodewriter:WARNING] (pypy.module._cffi_backend.misc:379)pack_float_list_to_raw_array__LongFloat
[jitcodewriter:WARNING] type LongFloat is too large, ignoring graph
[jitcodewriter:WARNING] (pypy.module._rawffi.interp_rawffi:409)unwrap_value__write_ptr
[jitcodewriter:WARNING] type LongFloat is too large, ignoring graph
[jitcodewriter:WARNING] (pypy.module._rawffi.interp_rawffi:409)unwrap_value__push_field
[jitcodewriter:WARNING] type SignedLongLongLong is too large, ignoring graph
[jitcodewriter:WARNING] (rpython.rlib.rarithmetic:864)mulmod
[jitcodewriter:WARNING] type SignedLongLongLong is too large, ignoring graph
[jitcodewriter:WARNING] (rpython.rlib.rarithmetic:864)mulmod
[jitcodewriter:WARNING] type SignedLongLongLong is too large, ignoring graph
[jitcodewriter:WARNING] (rpython.rlib.rarithmetic:864)mulmod
[jitcodewriter:WARNING] type LongFloat is too large, ignoring graph
[jitcodewriter:WARNING] (pypy.module._rawffi.interp_rawffi:456)wrap_value__read_ptr
[jitcodewriter:WARNING] type LongFloat is too large, ignoring graph
[jitcodewriter:WARNING] (pypy.module._rawffi.interp_rawffi:456)wrap_value__cast_pos
[backendopt:removeassert] Could not remove 62 asserts, but removed 1402 asserts.
[backendopt:inlining] phase with threshold factor: 32.4
[backendopt:inlining] heuristic: rpython.translator.backendopt.inline.inlining_heuristic
[backendopt:inlining] inlined 45679 callsites.
[backendopt:malloc] starting malloc removal
[backendopt:malloc] removed 7831 simple mallocs in total
[backendopt:mergeifblocks] starting to merge if blocks
[rtyper] specializing: 210200 / 210465 blocks (99%)
[rtyper] -=- specialized 291 more blocks -=-
[jitcodewriter:info] making JitCodes...
[rtyper] -=- specialized 2 more blocks -=-
[rtyper] -=- specialized 2 more blocks -=-
[rtyper] -=- specialized 2 more blocks -=-
[rtyper] -=- specialized 2 more blocks -=-
[rtyper] -=- specialized 7 more blocks -=-
[rtyper] -=- specialized 6 more blocks -=-
[rtyper] -=- specialized 3 more blocks -=-
[rtyper] -=- specialized 6 more blocks -=-
[rtyper] -=- specialized 3 more blocks -=-
[rtyper] specializing: 210500 / 210502 blocks (99%)
[rtyper] -=- specialized 4 more blocks -=-
[rtyper] -=- specialized 5 more blocks -=-
[rtyper] -=- specialized 2 more blocks -=-
[rtyper] -=- specialized 2 more blocks -=-
[rtyper] -=- specialized 2 more blocks -=-
[rtyper] -=- specialized 2 more blocks -=-
[jitcodewriter:info] Produced 500 jitcodes
[rtyper] -=- specialized 2 more blocks -=-
[rtyper] -=- specialized 2 more blocks -=-
[rtyper] -=- specialized 2 more blocks -=-
[rtyper] -=- specialized 2 more blocks -=-
[rtyper] -=- specialized 0 more blocks -=-
[rtyper] -=- specialized 0 more blocks -=-
[jitcodewriter:info] Produced 1000 jitcodes
[rtyper] -=- specialized 0 more blocks -=-
[rtyper] -=- specialized 0 more blocks -=-
[rtyper] -=- specialized 0 more blocks -=-
[rtyper] -=- specialized 0 more blocks -=-
[rtyper] -=- specialized 2 more blocks -=-
[rtyper] -=- specialized 2 more blocks -=-
[rtyper] -=- specialized 2 more blocks -=-
[jitcodewriter:info] Produced 1500 jitcodes
[jitcodewriter:info] Produced 2000 jitcodes
[rtyper] -=- specialized 0 more blocks -=-
[rtyper] -=- specialized 0 more blocks -=-
[rtyper] -=- specialized 0 more blocks -=-
[jitcodewriter:info] Produced 2500 jitcodes
[rtyper] -=- specialized 2 more blocks -=-
[rtyper] -=- specialized 2 more blocks -=-
[rtyper] -=- specialized 2 more blocks -=-
[rtyper] -=- specialized 2 more blocks -=-
[rtyper] -=- specialized 2 more blocks -=-
[rtyper] -=- specialized 2 more blocks -=-
[rtyper] -=- specialized 2 more blocks -=-
[rtyper] -=- specialized 2 more blocks -=-
[rtyper] -=- specialized 2 more blocks -=-
[rtyper] -=- specialized 2 more blocks -=-
[rtyper] -=- specialized 2 more blocks -=-
[rtyper] -=- specialized 2 more blocks -=-
[rtyper] -=- specialized 2 more blocks -=-
[rtyper] -=- specialized 2 more blocks -=-
[rtyper] -=- specialized 2 more blocks -=-
[rtyper] -=- specialized 0 more blocks -=-
[rtyper] -=- specialized 0 more blocks -=-
[rtyper] -=- specialized 0 more blocks -=-
[rtyper] -=- specialized 0 more blocks -=-
[rtyper] -=- specialized 0 more blocks -=-
[rtyper] -=- specialized 0 more blocks -=-
[rtyper] -=- specialized 0 more blocks -=-
[rtyper] -=- specialized 0 more blocks -=-
[rtyper] -=- specialized 0 more blocks -=-
[jitcodewriter:info] Produced 3000 jitcodes
[rtyper] -=- specialized 0 more blocks -=-
[rtyper] -=- specialized 0 more blocks -=-
[rtyper] -=- specialized 0 more blocks -=-
[rtyper] -=- specialized 0 more blocks -=-
[rtyper] -=- specialized 2 more blocks -=-
[rtyper] -=- specialized 2 more blocks -=-
[rtyper] -=- specialized 2 more blocks -=-
[rtyper] -=- specialized 2 more blocks -=-
[rtyper] -=- specialized 2 more blocks -=-
[rtyper] -=- specialized 2 more blocks -=-
[rtyper] -=- specialized 2 more blocks -=-
[rtyper] -=- specialized 2 more blocks -=-
[rtyper] -=- specialized 2 more blocks -=-
[jitcodewriter:info] Produced 3500 jitcodes
[rtyper] -=- specialized 2 more blocks -=-
[rtyper] -=- specialized 2 more blocks -=-
[rtyper] -=- specialized 2 more blocks -=-
[rtyper] -=- specialized 2 more blocks -=-
[rtyper] -=- specialized 2 more blocks -=-
[rtyper] -=- specialized 2 more blocks -=-
[rtyper] -=- specialized 2 more blocks -=-
[rtyper] -=- specialized 2 more blocks -=-
[rtyper] -=- specialized 0 more blocks -=-
[rtyper] -=- specialized 2 more blocks -=-
[rtyper] -=- specialized 2 more blocks -=-
[rtyper] -=- specialized 2 more blocks -=-
[rtyper] specializing: 210600 / 210601 blocks (99%)
[rtyper] -=- specialized 2 more blocks -=-
[rtyper] -=- specialized 2 more blocks -=-
[rtyper] -=- specialized 2 more blocks -=-
[rtyper] -=- specialized 2 more blocks -=-
[jitcodewriter:info] Produced 4000 jitcodes
[rtyper] -=- specialized 2 more blocks -=-
[rtyper] -=- specialized 2 more blocks -=-
[rtyper] -=- specialized 2 more blocks -=-
[rtyper] -=- specialized 2 more blocks -=-
[rtyper] -=- specialized 2 more blocks -=-
[rtyper] -=- specialized 2 more blocks -=-
[rtyper] -=- specialized 2 more blocks -=-
[rtyper] -=- specialized 2 more blocks -=-
[rtyper] -=- specialized 2 more blocks -=-
[rtyper] -=- specialized 0 more blocks -=-
[rtyper] -=- specialized 2 more blocks -=-
[jitcodewriter:info] Produced 4500 jitcodes
[rtyper] -=- specialized 2 more blocks -=-
[jitcodewriter:info] Produced 5000 jitcodes
[rtyper] -=- specialized 2 more blocks -=-
[rtyper] -=- specialized 0 more blocks -=-
[jitcodewriter:info] Produced 5500 jitcodes
[rtyper] -=- specialized 2 more blocks -=-
[rtyper] -=- specialized 2 more blocks -=-
[rtyper] -=- specialized 0 more blocks -=-
[rtyper] -=- specialized 0 more blocks -=-
[rtyper] -=- specialized 2 more blocks -=-
[rtyper] -=- specialized 2 more blocks -=-
[rtyper] -=- specialized 2 more blocks -=-
[rtyper] -=- specialized 2 more blocks -=-
[rtyper] -=- specialized 2 more blocks -=-
[rtyper] -=- specialized 2 more blocks -=-
[rtyper] -=- specialized 2 more blocks -=-
[rtyper] -=- specialized 0 more blocks -=-
[rtyper] -=- specialized 0 more blocks -=-
[rtyper] -=- specialized 2 more blocks -=-
[rtyper] -=- specialized 2 more blocks -=-
[jitcodewriter:info] Produced 6000 jitcodes
[rtyper] -=- specialized 2 more blocks -=-
[rtyper] -=- specialized 2 more blocks -=-
[rtyper] -=- specialized 2 more blocks -=-
[rtyper] -=- specialized 2 more blocks -=-
[rtyper] -=- specialized 2 more blocks -=-
[rtyper] -=- specialized 2 more blocks -=-
[rtyper] -=- specialized 2 more blocks -=-
[rtyper] -=- specialized 0 more blocks -=-
[rtyper] -=- specialized 2 more blocks -=-
[rtyper] -=- specialized 2 more blocks -=-
[rtyper] -=- specialized 0 more blocks -=-
[rtyper] -=- specialized 0 more blocks -=-
[rtyper] -=- specialized 0 more blocks -=-
[jitcodewriter:info] Produced 6500 jitcodes
[rtyper] -=- specialized 0 more blocks -=-
[rtyper] -=- specialized 0 more blocks -=-
[rtyper] -=- specialized 0 more blocks -=-
[rtyper] -=- specialized 0 more blocks -=-
[rtyper] -=- specialized 0 more blocks -=-
[rtyper] -=- specialized 2 more blocks -=-
[jitcodewriter:info] Produced 7000 jitcodes
[rtyper] -=- specialized 2 more blocks -=-
[rtyper] -=- specialized 2 more blocks -=-
[jitcodewriter:info] Produced 7500 jitcodes
[rtyper] -=- specialized 2 more blocks -=-
[rtyper] -=- specialized 2 more blocks -=-
[rtyper] -=- specialized 2 more blocks -=-
[rtyper] -=- specialized 2 more blocks -=-
[rtyper] -=- specialized 2 more blocks -=-
[rtyper] -=- specialized 2 more blocks -=-
[rtyper] -=- specialized 2 more blocks -=-
[rtyper] -=- specialized 2 more blocks -=-
[rtyper] -=- specialized 2 more blocks -=-
[rtyper] -=- specialized 2 more blocks -=-
[rtyper] -=- specialized 2 more blocks -=-
[jitcodewriter:info] Produced 8000 jitcodes
[rtyper] -=- specialized 0 more blocks -=-
[jitcodewriter:info] Produced 8500 jitcodes
[jitcodewriter:info] Produced 9000 jitcodes
[rtyper] specializing: 210700 / 210701 blocks (99%)
[rtyper] -=- specialized 2 more blocks -=-
[rtyper] -=- specialized 0 more blocks -=-
[jitcodewriter:WARNING] ignoring hint {'access_directly': False} at <FunctionGraph of (pypy.interpreter.executioncontext:368)ExecutionContext._trace at 0x7fd7ed95e598>
[jitcodewriter:WARNING] ignoring hint {'access_directly': False} at <FunctionGraph of dispatcher_app_profile_call_etc at 0x7fd7eda03948>
[jitcodewriter:info] Produced 9500 jitcodes
[rtyper] -=- specialized 2 more blocks -=-
[rtyper] -=- specialized 2 more blocks -=-
[rtyper] -=- specialized 2 more blocks -=-
[rtyper] -=- specialized 2 more blocks -=-
[rtyper] -=- specialized 2 more blocks -=-
[rtyper] -=- specialized 2 more blocks -=-
[rtyper] -=- specialized 2 more blocks -=-
[rtyper] -=- specialized 2 more blocks -=-
[rtyper] -=- specialized 2 more blocks -=-
[rtyper] -=- specialized 2 more blocks -=-
[rtyper] -=- specialized 2 more blocks -=-
[rtyper] -=- specialized 2 more blocks -=-
[rtyper] -=- specialized 2 more blocks -=-
[rtyper] -=- specialized 2 more blocks -=-
[rtyper] -=- specialized 2 more blocks -=-
[rtyper] -=- specialized 2 more blocks -=-
[rtyper] -=- specialized 2 more blocks -=-
[jitcodewriter:info] Produced 10000 jitcodes
[rtyper] -=- specialized 2 more blocks -=-
[rtyper] -=- specialized 2 more blocks -=-
[jitcodewriter:info] Produced 10500 jitcodes
[jitcodewriter:info] Produced 11000 jitcodes
[rtyper] -=- specialized 2 more blocks -=-
[rtyper] -=- specialized 0 more blocks -=-
[rtyper] -=- specialized 2 more blocks -=-
[jitcodewriter:info] Produced 11500 jitcodes
[jitcodewriter:WARNING] ignoring hint {'access_directly': False} at <FunctionGraph of (pypy.interpreter.executioncontext:368)_trace__AccessDirect_None at 0x7fd7e173e9f8>
[rtyper] -=- specialized 2 more blocks -=-
[rtyper] -=- specialized 2 more blocks -=-
[rtyper] -=- specialized 2 more blocks -=-
[rtyper] -=- specialized 2 more blocks -=-
[jitcodewriter:info] There are 11809 JitCode instances.
[jitcodewriter:info] There are 89688 -live- ops. Size of liveness is 9082 bytes
[rtyper] replaced 41 'jit_force_virtual' with <* delayed!force_virtual_if_necessary>
[rtyper] replaced 318 'jit_force_virtualizable' with <* delayed!force_virtualizable_if_necessary>
[jitcodewriter] compute_bitstrings:
[jitcodewriter] 1008 effectinfos:
[jitcodewriter] 46 descrs for arrays
[jitcodewriter] 1137 descrs for fields
[jitcodewriter] 55 descrs for interiorfields
[jitcodewriter] -> 893 bitstrings, mean length 41.7, max length 87
[rtyper] specializing: 210800 / 295510 blocks (71%)
[rtyper] specializing: 225000 / 296005 blocks (76%)
[rtyper] specializing: 242000 / 298728 blocks (81%)
[rtyper] specializing: 260300 / 302611 blocks (86%)
[rtyper] specializing: 277700 / 305108 blocks (91%)
[rtyper] specializing: 293100 / 305233 blocks (96%)
[rtyper] specializing: 295600 / 305233 blocks (96%)
[rtyper] -=- specialized 94482 more blocks -=-
[rtyper] -=- specialized 2 more blocks -=-
[translation:info] the JIT compiler was generated
[translation:info] lltype back-end optimisations...
[backendopt:inlining] phase with threshold factor: 32.4
[backendopt:inlining] heuristic: rpython.translator.backendopt.inline.inlining_heuristic
[backendopt:inlining] inlined 138918 callsites.
[backendopt:malloc] starting malloc removal
[backendopt:malloc] removed 28861 simple mallocs in total
[backendopt:mergeifblocks] starting to merge if blocks
[translation:info] inserting stack checks...
[rtyper] -=- specialized 0 more blocks -=-
[translation:info] inserted 3024 stack checks.
[translation:info] Creating database for generating c source...
[rtyper] -=- specialized 21 more blocks -=-
[rtyper] -=- specialized 5 more blocks -=-
[rtyper] specializing: 305300 / 308121 blocks (99%)
[rtyper] -=- specialized 2862 more blocks -=-
[rtyper] -=- specialized 43 more blocks -=-
[backendopt:inlining] phase with threshold factor: 32.4
[backendopt:inlining] heuristic: rpython.translator.backendopt.inline.inlining_heuristic
[backendopt:inlining] inlined 1685 callsites.
[backendopt:malloc] starting malloc removal
[backendopt:malloc] removed 16 simple mallocs in total
[backendopt:mergeifblocks] starting to merge if blocks
[rtyper] -=- specialized 12 more blocks -=-
[rtyper] specializing: 308200 / 308200 blocks (100%)
[rtyper] -=- specialized 22 more blocks -=-
[rtyper] -=- specialized 17 more blocks -=-
[rtyper] -=- specialized 12 more blocks -=-
[rtyper] -=- specialized 21 more blocks -=-
[rtyper] -=- specialized 5 more blocks -=-
[rtyper] -=- specialized 0 more blocks -=-
[c] 1000 nodes [ array: 628 framework rtti: 3 func: 1408 group: 1 struct: 683 ]
[c] 2000 nodes [ array: 638 framework rtti: 8 func: 1721 group: 1 struct: 4203 ]
[c] 3000 nodes [ array: 751 framework rtti: 21 func: 1997 group: 1 struct: 4859 ]
[c] 4000 nodes [ array: 824 framework rtti: 25 func: 2189 group: 1 struct: 5439 ]
[c] 5000 nodes [ array: 1322 framework rtti: 26 func: 2271 group: 1 struct: 5949 ]
[c] 6000 nodes [ array: 1744 framework rtti: 26 func: 2284 group: 1 struct: 6412 ]
[c] 7000 nodes [ array: 1924 framework rtti: 35 func: 2403 group: 1 struct: 9020 ]
[c] 8000 nodes [ array: 2200 framework rtti: 43 func: 2605 group: 1 struct: 10232 ]
[c] 9000 nodes [ array: 2373 framework rtti: 52 func: 2908 group: 1 struct: 10973 ]
[c] 10000 nodes [ array: 2374 framework rtti: 117 func: 3588 group: 1 struct: 11684 ]
[c] 11000 nodes [ array: 2750 framework rtti: 160 func: 3966 group: 1 struct: 12220 ]
[c] 12000 nodes [ array: 4750 framework rtti: 160 func: 3966 group: 1 struct: 12220 ]
[c] 13000 nodes [ array: 6527 framework rtti: 160 func: 3976 group: 1 struct: 12340 ]
[c] 14000 nodes [ array: 6664 framework rtti: 177 func: 4105 group: 1 struct: 13587 ]
[c] 15000 nodes [ array: 6920 framework rtti: 183 func: 4192 group: 1 struct: 16800 ]
[c] 16000 nodes [ array: 7214 framework rtti: 202 func: 4430 group: 1 struct: 17962 ]
[c] 17000 nodes [ array: 7351 framework rtti: 273 func: 5347 group: 1 struct: 20234 ]
[c] 18000 nodes [ array: 7595 framework rtti: 385 func: 5555 group: 1 struct: 22104 ]
[c] 19000 nodes [ array: 7618 framework rtti: 685 func: 5868 group: 1 struct: 22624 ]
[c] 20000 nodes [ array: 7618 framework rtti: 685 func: 5868 group: 1 struct: 22624 ]
[c] 21000 nodes [ array: 7618 framework rtti: 685 func: 5868 group: 1 struct: 22624 ]
[c] 22000 nodes [ array: 7618 framework rtti: 685 func: 5868 group: 1 struct: 22624 ]
[c] 23000 nodes [ array: 7646 framework rtti: 687 func: 5878 group: 1 struct: 22926 ]
[c] 24000 nodes [ array: 7839 framework rtti: 697 func: 6096 group: 1 struct: 24514 ]
[c] 25000 nodes [ array: 7969 framework rtti: 700 func: 6318 group: 1 struct: 25758 ]
[c] 26000 nodes [ array: 8013 framework rtti: 703 func: 6367 group: 1 struct: 26651 ]
[c] 27000 nodes [ array: 8013 framework rtti: 703 func: 6367 group: 1 struct: 27670 ]
[c] 28000 nodes [ array: 8067 framework rtti: 705 func: 6467 group: 1 struct: 28642 ]
[c] 29000 nodes [ array: 8183 framework rtti: 710 func: 6584 group: 1 struct: 29495 ]
[c] 30000 nodes [ array: 8343 framework rtti: 735 func: 6884 group: 1 struct: 30147 ]
[c] 31000 nodes [ array: 8442 framework rtti: 775 func: 7222 group: 1 struct: 30706 ]
[c] 32000 nodes [ array: 8623 framework rtti: 805 func: 7490 group: 1 struct: 31090 ]
[c] 33000 nodes [ array: 8692 framework rtti: 833 func: 7637 group: 1 struct: 31867 ]
[c] 34000 nodes [ array: 8870 framework rtti: 901 func: 7892 group: 1 struct: 32431 ]
[c] 35000 nodes [ array: 9101 framework rtti: 945 func: 8154 group: 1 struct: 32879 ]
[c] 36000 nodes [ array: 9358 framework rtti: 1058 func: 8351 group: 1 struct: 33441 ]
[c] 37000 nodes [ array: 9752 framework rtti: 1064 func: 8619 group: 1 struct: 33896 ]
[c] 38000 nodes [ array: 10059 framework rtti: 1074 func: 8774 group: 1 struct: 34557 ]
[c] 39000 nodes [ array: 10259 framework rtti: 1076 func: 8936 group: 1 struct: 35609 ]
[c] 40000 nodes [ array: 10471 framework rtti: 1076 func: 9120 group: 1 struct: 36626 ]
[c] 41000 nodes [ array: 10625 framework rtti: 1086 func: 9256 group: 1 struct: 37351 ]
[c] 42000 nodes [ array: 11045 framework rtti: 1086 func: 9263 group: 1 struct: 37845 ]
[c] 43000 nodes [ array: 11475 framework rtti: 1086 func: 9263 group: 1 struct: 38359 ]
[c] 44000 nodes [ array: 11668 framework rtti: 1086 func: 9390 group: 1 struct: 39477 ]
[c] 45000 nodes [ array: 11819 framework rtti: 1094 func: 9542 group: 1 struct: 40429 ]
[c] 46000 nodes [ array: 11962 framework rtti: 1100 func: 9776 group: 1 struct: 41083 ]
[c] 47000 nodes [ array: 12061 framework rtti: 1121 func: 10146 group: 1 struct: 42117 ]
[c] 48000 nodes [ array: 12174 framework rtti: 1127 func: 10499 group: 1 struct: 42951 ]
[c] 49000 nodes [ array: 17319 framework rtti: 1131 func: 10570 group: 1 struct: 47007 ]
[c] 50000 nodes [ array: 17423 framework rtti: 1141 func: 10846 group: 1 struct: 47898 ]
[c] 51000 nodes [ array: 17491 framework rtti: 1145 func: 11148 group: 1 struct: 48718 ]
[c] 52000 nodes [ array: 17587 framework rtti: 1153 func: 11387 group: 1 struct: 49114 ]
[c] 53000 nodes [ array: 17779 framework rtti: 1162 func: 11600 group: 1 struct: 49893 ]
[c] 54000 nodes [ array: 17826 framework rtti: 1167 func: 11735 group: 1 struct: 50934 ]
[c] 55000 nodes [ array: 17976 framework rtti: 1172 func: 11899 group: 1 struct: 51924 ]
[c] 56000 nodes [ array: 18128 framework rtti: 1174 func: 11986 group: 1 struct: 64355 ]
[c] 57000 nodes [ array: 18349 framework rtti: 1177 func: 12134 group: 1 struct: 65122 ]
[c] 58000 nodes [ array: 18565 framework rtti: 1180 func: 12318 group: 1 struct: 66010 ]
[c] 59000 nodes [ array: 18610 framework rtti: 1183 func: 12364 group: 1 struct: 66552 ]
[c] 60000 nodes [ array: 18610 framework rtti: 1183 func: 12364 group: 1 struct: 67089 ]
[c] 61000 nodes [ array: 18711 framework rtti: 1183 func: 12461 group: 1 struct: 67805 ]
[c] 62000 nodes [ array: 18877 framework rtti: 1190 func: 12650 group: 1 struct: 68345 ]
[c] 63000 nodes [ array: 18986 framework rtti: 1197 func: 12856 group: 1 struct: 69066 ]
[c] 64000 nodes [ array: 19152 framework rtti: 1203 func: 13076 group: 1 struct: 69636 ]
[c] 65000 nodes [ array: 19332 framework rtti: 1216 func: 13311 group: 1 struct: 70410 ]
[c] 66000 nodes [ array: 19532 framework rtti: 1232 func: 13543 group: 1 struct: 71257 ]
[c] 67000 nodes [ array: 19769 framework rtti: 1235 func: 13733 group: 1 struct: 72271 ]
[c] 68000 nodes [ array: 20001 framework rtti: 1235 func: 13733 group: 1 struct: 72776 ]
[c] 69000 nodes [ array: 20234 framework rtti: 1235 func: 13733 group: 1 struct: 73218 ]
[c] 70000 nodes [ array: 20472 framework rtti: 1235 func: 13733 group: 1 struct: 73744 ]
[c] 71000 nodes [ array: 20714 framework rtti: 1235 func: 13733 group: 1 struct: 74453 ]
[c] 72000 nodes [ array: 20944 framework rtti: 1235 func: 13733 group: 1 struct: 75377 ]
[c] 73000 nodes [ array: 21184 framework rtti: 1235 func: 13733 group: 1 struct: 76258 ]
[c] 74000 nodes [ array: 21418 framework rtti: 1235 func: 13733 group: 1 struct: 76903 ]
[c] 75000 nodes [ array: 21669 framework rtti: 1235 func: 13733 group: 1 struct: 77519 ]
[c] 76000 nodes [ array: 21887 framework rtti: 1235 func: 13807 group: 1 struct: 78278 ]
[c] 77000 nodes [ array: 22094 framework rtti: 1237 func: 14062 group: 1 struct: 79085 ]
[c] 78000 nodes [ array: 22393 framework rtti: 1242 func: 14373 group: 1 struct: 79940 ]
[c] 79000 nodes [ array: 22617 framework rtti: 1247 func: 14695 group: 1 struct: 80994 ]
[c] 80000 nodes [ array: 22899 framework rtti: 1252 func: 14917 group: 1 struct: 81402 ]
[c] 81000 nodes [ array: 23360 framework rtti: 1255 func: 15031 group: 1 struct: 81833 ]
[c] 82000 nodes [ array: 23440 framework rtti: 1257 func: 15167 group: 1 struct: 82677 ]
[c] 83000 nodes [ array: 23662 framework rtti: 1258 func: 15280 group: 1 struct: 112633 ]
[c] 84000 nodes [ array: 24470 framework rtti: 1258 func: 15468 group: 1 struct: 115094 ]
[c] 85000 nodes [ array: 25346 framework rtti: 1258 func: 15576 group: 1 struct: 117627 ]
[c] 86000 nodes [ array: 26240 framework rtti: 1258 func: 15788 group: 1 struct: 119875 ]
[c] 87000 nodes [ array: 27620 framework rtti: 1258 func: 16189 group: 1 struct: 122179 ]
[c] 88000 nodes [ array: 29341 framework rtti: 1258 func: 16791 group: 1 struct: 124353 ]
[c] 89000 nodes [ array: 31011 framework rtti: 1258 func: 17400 group: 1 struct: 126575 ]
[c] 90000 nodes [ array: 32636 framework rtti: 1258 func: 17961 group: 1 struct: 128620 ]
[c] 91000 nodes [ array: 34204 framework rtti: 1258 func: 18612 group: 1 struct: 130794 ]
[c] 92000 nodes [ array: 35929 framework rtti: 1258 func: 19075 group: 1 struct: 132871 ]
[c] 93000 nodes [ array: 37527 framework rtti: 1258 func: 19709 group: 1 struct: 135163 ]
[c] 94000 nodes [ array: 39119 framework rtti: 1258 func: 20356 group: 1 struct: 137655 ]
[c] 95000 nodes [ array: 40296 framework rtti: 1260 func: 20791 group: 1 struct: 139521 ]
[c] 96000 nodes [ array: 40507 framework rtti: 1262 func: 20806 group: 1 struct: 140137 ]
[c] 97000 nodes [ array: 40717 framework rtti: 1265 func: 20838 group: 1 struct: 140428 ]
[c] 98000 nodes [ array: 40954 framework rtti: 1266 func: 20898 group: 1 struct: 140934 ]
[c] 99000 nodes [ array: 41041 framework rtti: 1266 func: 20946 group: 1 struct: 141868 ]
[c] 100000 nodes [ array: 41225 framework rtti: 1266 func: 20956 group: 1 struct: 142477 ]
[c] 101000 nodes [ array: 41465 framework rtti: 1271 func: 20987 group: 1 struct: 142810 ]
[c] 102000 nodes [ array: 41776 framework rtti: 1272 func: 21079 group: 1 struct: 143607 ]
[c] 103000 nodes [ array: 41965 framework rtti: 1278 func: 21223 group: 1 struct: 144036 ]
[c] 104000 nodes [ array: 42191 framework rtti: 1280 func: 21298 group: 1 struct: 144896 ]
[c] 105000 nodes [ array: 42409 framework rtti: 1282 func: 21403 group: 1 struct: 145518 ]
[c] 106000 nodes [ array: 42579 framework rtti: 1282 func: 21430 group: 1 struct: 146083 ]
[c] 107000 nodes [ array: 42777 framework rtti: 1282 func: 21444 group: 1 struct: 146841 ]
[c] 108000 nodes [ array: 42897 framework rtti: 1282 func: 21444 group: 1 struct: 147246 ]
[c] 109000 nodes [ array: 43029 framework rtti: 1282 func: 21444 group: 1 struct: 147582 ]
[c] 110000 nodes [ array: 43162 framework rtti: 1282 func: 21444 group: 1 struct: 147933 ]
[c] 111000 nodes [ array: 43361 framework rtti: 1282 func: 21444 group: 1 struct: 148295 ]
[c] 112000 nodes [ array: 43507 framework rtti: 1282 func: 21444 group: 1 struct: 148651 ]
[c] 113000 nodes [ array: 43608 framework rtti: 1282 func: 21444 group: 1 struct: 149089 ]
[c] 114000 nodes [ array: 43754 framework rtti: 1282 func: 21444 group: 1 struct: 149407 ]
[c] 115000 nodes [ array: 43921 framework rtti: 1282 func: 21456 group: 1 struct: 149801 ]
[c] 116000 nodes [ array: 44116 framework rtti: 1282 func: 21502 group: 1 struct: 150375 ]
[c] 117000 nodes [ array: 44298 framework rtti: 1282 func: 21567 group: 1 struct: 150822 ]
[c] 118000 nodes [ array: 44473 framework rtti: 1282 func: 21580 group: 1 struct: 151389 ]
[c] 119000 nodes [ array: 44681 framework rtti: 1283 func: 21621 group: 1 struct: 151885 ]
[c] 120000 nodes [ array: 44887 framework rtti: 1286 func: 21784 group: 1 struct: 152469 ]
[c] 121000 nodes [ array: 45058 framework rtti: 1288 func: 21871 group: 1 struct: 152752 ]
[c] 122000 nodes [ array: 45217 framework rtti: 1290 func: 21969 group: 1 struct: 153728 ]
[c] 123000 nodes [ array: 45421 framework rtti: 1290 func: 21976 group: 1 struct: 154188 ]
[c] 124000 nodes [ array: 45482 framework rtti: 1291 func: 22007 group: 1 struct: 154727 ]
[c] 125000 nodes [ array: 45523 framework rtti: 1291 func: 22028 group: 1 struct: 155259 ]
[c] 126000 nodes [ array: 45549 framework rtti: 1291 func: 22050 group: 1 struct: 155791 ]
[c] 127000 nodes [ array: 45630 framework rtti: 1291 func: 22104 group: 1 struct: 156378 ]
[c] 128000 nodes [ array: 45733 framework rtti: 1291 func: 22157 group: 1 struct: 156942 ]
[c] 129000 nodes [ array: 45916 framework rtti: 1291 func: 22179 group: 1 struct: 157449 ]
[c] 130000 nodes [ array: 45991 framework rtti: 1291 func: 22239 group: 1 struct: 158104 ]
[c] 131000 nodes [ array: 46159 framework rtti: 1291 func: 22312 group: 1 struct: 158866 ]
[c] 132000 nodes [ array: 46417 framework rtti: 1291 func: 22400 group: 1 struct: 159707 ]
[c] 133000 nodes [ array: 46524 framework rtti: 1291 func: 22447 group: 1 struct: 160400 ]
[c] 134000 nodes [ array: 46638 framework rtti: 1291 func: 22518 group: 1 struct: 161076 ]
[c] 135000 nodes [ array: 46775 framework rtti: 1291 func: 22576 group: 1 struct: 161711 ]
[c] 136000 nodes [ array: 46887 framework rtti: 1291 func: 22633 group: 1 struct: 162370 ]
[c] 137000 nodes [ array: 47039 framework rtti: 1291 func: 22666 group: 1 struct: 162991 ]
[c] 138000 nodes [ array: 47169 framework rtti: 1291 func: 22725 group: 1 struct: 163647 ]
[c] 139000 nodes [ array: 47242 framework rtti: 1291 func: 22763 group: 1 struct: 164249 ]
[c] 140000 nodes [ array: 47310 framework rtti: 1291 func: 22806 group: 1 struct: 164911 ]
[c] 141000 nodes [ array: 47398 framework rtti: 1291 func: 22861 group: 1 struct: 165589 ]
[c] 142000 nodes [ array: 47496 framework rtti: 1291 func: 22914 group: 1 struct: 166212 ]
[c] 143000 nodes [ array: 47668 framework rtti: 1291 func: 22966 group: 1 struct: 166937 ]
[c] 144000 nodes [ array: 47943 framework rtti: 1291 func: 23007 group: 1 struct: 167559 ]
[c] 145000 nodes [ array: 48138 framework rtti: 1291 func: 23055 group: 1 struct: 168319 ]
[c] 146000 nodes [ array: 48268 framework rtti: 1291 func: 23103 group: 1 struct: 169026 ]
[c] 147000 nodes [ array: 48429 framework rtti: 1291 func: 23138 group: 1 struct: 169769 ]
[c] 148000 nodes [ array: 48618 framework rtti: 1291 func: 23173 group: 1 struct: 170225 ]
[c] 149000 nodes [ array: 48792 framework rtti: 1291 func: 23201 group: 1 struct: 170976 ]
[c] 150000 nodes [ array: 49033 framework rtti: 1291 func: 23222 group: 1 struct: 171779 ]
[c] 151000 nodes [ array: 49195 framework rtti: 1291 func: 23257 group: 1 struct: 172585 ]
[c] 152000 nodes [ array: 49426 framework rtti: 1291 func: 23273 group: 1 struct: 173430 ]
[c] 153000 nodes [ array: 49643 framework rtti: 1292 func: 23348 group: 1 struct: 174017 ]
[c] 154000 nodes [ array: 50186 framework rtti: 1292 func: 23361 group: 1 struct: 174271 ]
[c] 155000 nodes [ array: 50714 framework rtti: 1292 func: 23417 group: 1 struct: 174484 ]
[c] 156000 nodes [ array: 51220 framework rtti: 1292 func: 23476 group: 1 struct: 174631 ]
[c] 157000 nodes [ array: 51730 framework rtti: 1292 func: 23540 group: 1 struct: 174756 ]
[c] 158000 nodes [ array: 52245 framework rtti: 1292 func: 23557 group: 1 struct: 174914 ]
[c] 159000 nodes [ array: 52827 framework rtti: 1292 func: 23560 group: 1 struct: 175201 ]
[c] 160000 nodes [ array: 53409 framework rtti: 1292 func: 23674 group: 1 struct: 175379 ]
[c] 161000 nodes [ array: 53968 framework rtti: 1292 func: 23690 group: 1 struct: 175605 ]
[c] 162000 nodes [ array: 54355 framework rtti: 1292 func: 23734 group: 1 struct: 175802 ]
[c] 163000 nodes [ array: 54805 framework rtti: 1292 func: 23758 group: 1 struct: 175967 ]
[c] 164000 nodes [ array: 55334 framework rtti: 1292 func: 23791 group: 1 struct: 176172 ]
[c] 165000 nodes [ array: 55792 framework rtti: 1292 func: 23846 group: 1 struct: 176333 ]
[c] 166000 nodes [ array: 56192 framework rtti: 1292 func: 23927 group: 1 struct: 176483 ]
[c] 167000 nodes [ array: 56592 framework rtti: 1292 func: 23971 group: 1 struct: 176636 ]
[c] 168000 nodes [ array: 57027 framework rtti: 1292 func: 24034 group: 1 struct: 176770 ]
[c] 169000 nodes [ array: 57375 framework rtti: 1292 func: 24087 group: 1 struct: 176941 ]
[c] 170000 nodes [ array: 57771 framework rtti: 1292 func: 24112 group: 1 struct: 177100 ]
[c] 171000 nodes [ array: 58040 framework rtti: 1292 func: 24127 group: 1 struct: 177276 ]
[c] 172000 nodes [ array: 58284 framework rtti: 1292 func: 24131 group: 1 struct: 177481 ]
[c] 173000 nodes [ array: 58623 framework rtti: 1292 func: 24138 group: 1 struct: 177684 ]
[c] 174000 nodes [ array: 58995 framework rtti: 1292 func: 24179 group: 1 struct: 177833 ]
[c] 175000 nodes [ array: 59323 framework rtti: 1292 func: 24224 group: 1 struct: 177969 ]
[c] 176000 nodes [ array: 59676 framework rtti: 1292 func: 24271 group: 1 struct: 178203 ]
[c] 177000 nodes [ array: 60048 framework rtti: 1292 func: 24347 group: 1 struct: 178352 ]
[c] 178000 nodes [ array: 60408 framework rtti: 1292 func: 24359 group: 1 struct: 178542 ]
[c] 179000 nodes [ array: 60678 framework rtti: 1292 func: 24367 group: 1 struct: 178706 ]
[c] 180000 nodes [ array: 61012 framework rtti: 1292 func: 24395 group: 1 struct: 178893 ]
[c] 181000 nodes [ array: 61326 framework rtti: 1292 func: 24420 group: 1 struct: 179083 ]
[c] 182000 nodes [ array: 61705 framework rtti: 1292 func: 24490 group: 1 struct: 179225 ]
[c] 183000 nodes [ array: 62062 framework rtti: 1292 func: 24540 group: 1 struct: 179370 ]
[c] 184000 nodes [ array: 62436 framework rtti: 1292 func: 24562 group: 1 struct: 179574 ]
[c] 185000 nodes [ array: 62843 framework rtti: 1292 func: 24597 group: 1 struct: 179750 ]
[c] 186000 nodes [ array: 63194 framework rtti: 1292 func: 24640 group: 1 struct: 179908 ]
[c] 187000 nodes [ array: 63492 framework rtti: 1292 func: 24660 group: 1 struct: 180096 ]
[c] 188000 nodes [ array: 63797 framework rtti: 1292 func: 24693 group: 1 struct: 180302 ]
[c] 189000 nodes [ array: 64140 framework rtti: 1292 func: 24715 group: 1 struct: 180473 ]
[c] 190000 nodes [ array: 64467 framework rtti: 1292 func: 24768 group: 1 struct: 180706 ]
[c] 191000 nodes [ array: 64835 framework rtti: 1292 func: 24822 group: 1 struct: 180889 ]
[c] 192000 nodes [ array: 65167 framework rtti: 1292 func: 24835 group: 1 struct: 181085 ]
[c] 193000 nodes [ array: 65513 framework rtti: 1292 func: 24874 group: 1 struct: 181275 ]
[c] 194000 nodes [ array: 65880 framework rtti: 1292 func: 24902 group: 1 struct: 181485 ]
[c] 195000 nodes [ array: 66234 framework rtti: 1292 func: 24926 group: 1 struct: 181649 ]
[c] 196000 nodes [ array: 66573 framework rtti: 1292 func: 24943 group: 1 struct: 181892 ]
[c] 197000 nodes [ array: 66923 framework rtti: 1292 func: 24946 group: 1 struct: 182092 ]
[c] 198000 nodes [ array: 67258 framework rtti: 1292 func: 24946 group: 1 struct: 182313 ]
[c] 199000 nodes [ array: 67648 framework rtti: 1292 func: 25007 group: 1 struct: 182526 ]
[c] 200000 nodes [ array: 67883 framework rtti: 1292 func: 25247 group: 1 struct: 182861 ]
[c] 201000 nodes [ array: 68205 framework rtti: 1292 func: 25262 group: 1 struct: 183111 ]
[c] 202000 nodes [ array: 68481 framework rtti: 1296 func: 25356 group: 1 struct: 183830 ]
[c] 203000 nodes [ array: 68597 framework rtti: 1299 func: 25361 group: 1 struct: 184621 ]
[c] 204000 nodes [ array: 68705 framework rtti: 1302 func: 25424 group: 1 struct: 186968 ]
[c] 205000 nodes [ array: 68780 framework rtti: 1302 func: 25449 group: 1 struct: 187300 ]
[c] 206000 nodes [ array: 68793 framework rtti: 1302 func: 25455 group: 1 struct: 187347 ]
[c] 207000 nodes [ array: 68864 framework rtti: 1313 func: 25504 group: 1 struct: 187638 ]
[c] 208000 nodes [ array: 69094 framework rtti: 1318 func: 25529 group: 1 struct: 188008 ]
[c] 209000 nodes [ array: 69236 framework rtti: 1332 func: 25719 group: 1 struct: 188455 ]
[c] 210000 nodes [ array: 69363 framework rtti: 1337 func: 25767 group: 1 struct: 189266 ]
[c] 211000 nodes [ array: 69507 framework rtti: 1345 func: 25792 group: 1 struct: 189958 ]
[c] 212000 nodes [ array: 69592 framework rtti: 1349 func: 25813 group: 1 struct: 190666 ]
[c] 213000 nodes [ array: 69717 framework rtti: 1349 func: 25813 group: 1 struct: 191223 ]
[c] 214000 nodes [ array: 69915 framework rtti: 1349 func: 25813 group: 1 struct: 191315 ]
[c] 215000 nodes [ array: 70104 framework rtti: 1349 func: 25813 group: 1 struct: 191392 ]
[c] 216000 nodes [ array: 70294 framework rtti: 1349 func: 25813 group: 1 struct: 191484 ]
[c] 217000 nodes [ array: 70468 framework rtti: 1349 func: 25834 group: 1 struct: 191747 ]
[c] 218000 nodes [ array: 70564 framework rtti: 1350 func: 25843 group: 1 struct: 192290 ]
[c] 219000 nodes [ array: 70655 framework rtti: 1350 func: 25847 group: 1 struct: 192866 ]
[c] 220000 nodes [ array: 70787 framework rtti: 1350 func: 25859 group: 1 struct: 193314 ]
[c] 221000 nodes [ array: 71217 framework rtti: 1363 func: 26063 group: 1 struct: 193672 ]
[c] 222000 nodes [ array: 71339 framework rtti: 1432 func: 26172 group: 1 struct: 196744 ]
[c] 223000 nodes [ array: 71405 framework rtti: 1439 func: 26174 group: 1 struct: 197078 ]
[c] 224000 nodes [ array: 71780 framework rtti: 1439 func: 26174 group: 1 struct: 197907 ]
[c] 225000 nodes [ array: 72168 framework rtti: 1439 func: 26174 group: 1 struct: 198560 ]
[c] 226000 nodes [ array: 72384 framework rtti: 1439 func: 26174 group: 1 struct: 199444 ]
[c] 227000 nodes [ array: 72568 framework rtti: 1439 func: 26174 group: 1 struct: 200277 ]
[c] 228000 nodes [ array: 72854 framework rtti: 1439 func: 26174 group: 1 struct: 201195 ]
[c] 229000 nodes [ array: 73093 framework rtti: 1439 func: 26174 group: 1 struct: 202185 ]
[c] 230000 nodes [ array: 73320 framework rtti: 1439 func: 26174 group: 1 struct: 203184 ]
[c] 231000 nodes [ array: 73570 framework rtti: 1439 func: 26174 group: 1 struct: 204157 ]
[c] 232000 nodes [ array: 73809 framework rtti: 1439 func: 26174 group: 1 struct: 205076 ]
[c] 233000 nodes [ array: 74062 framework rtti: 1439 func: 26175 group: 1 struct: 205999 ]
[c] 234000 nodes [ array: 74318 framework rtti: 1439 func: 26175 group: 1 struct: 206897 ]
[c] 235000 nodes [ array: 74538 framework rtti: 1439 func: 26175 group: 1 struct: 207836 ]
[c] 236000 nodes [ array: 74834 framework rtti: 1439 func: 26175 group: 1 struct: 208724 ]
[c] 237000 nodes [ array: 75103 framework rtti: 1439 func: 26175 group: 1 struct: 209557 ]
[c] 238000 nodes [ array: 75343 framework rtti: 1439 func: 26175 group: 1 struct: 210475 ]
[c] 239000 nodes [ array: 75547 framework rtti: 1439 func: 26175 group: 1 struct: 211479 ]
[c] 240000 nodes [ array: 75719 framework rtti: 1439 func: 26175 group: 1 struct: 212307 ]
[c] 241000 nodes [ array: 75951 framework rtti: 1439 func: 26175 group: 1 struct: 213304 ]
[c] 242000 nodes [ array: 76151 framework rtti: 1439 func: 26175 group: 1 struct: 214286 ]
[c] 243000 nodes [ array: 76370 framework rtti: 1439 func: 26175 group: 1 struct: 215173 ]
[c] 244000 nodes [ array: 76720 framework rtti: 1439 func: 26175 group: 1 struct: 216139 ]
[c] 245000 nodes [ array: 77096 framework rtti: 1439 func: 26175 group: 1 struct: 217157 ]
[c] 246000 nodes [ array: 77473 framework rtti: 1439 func: 26175 group: 1 struct: 218178 ]
[c] 247000 nodes [ array: 78026 framework rtti: 1439 func: 26175 group: 1 struct: 219210 ]
[c] 248000 nodes [ array: 78248 framework rtti: 1439 func: 26175 group: 1 struct: 220406 ]
[c] 249000 nodes [ array: 78281 framework rtti: 1439 func: 26178 group: 1 struct: 220741 ]
[c] 250000 nodes [ array: 78292 framework rtti: 1439 func: 26196 group: 1 struct: 220980 ]
[c] 251000 nodes [ array: 78296 framework rtti: 1439 func: 26251 group: 1 struct: 221182 ]
[c] 252000 nodes [ array: 78302 framework rtti: 1439 func: 26270 group: 1 struct: 221379 ]
[c] 253000 nodes [ array: 78302 framework rtti: 1439 func: 26288 group: 1 struct: 221691 ]
[c] 254000 nodes [ array: 78302 framework rtti: 1439 func: 26385 group: 1 struct: 221929 ]
[c] 255000 nodes [ array: 78308 framework rtti: 1439 func: 26400 group: 1 struct: 222202 ]
[c] 256000 nodes [ array: 78313 framework rtti: 1439 func: 26411 group: 1 struct: 222452 ]
[c] 257000 nodes [ array: 78325 framework rtti: 1439 func: 26430 group: 1 struct: 222686 ]
[c] 258000 nodes [ array: 78397 framework rtti: 1439 func: 26493 group: 1 struct: 222905 ]
[c] 259000 nodes [ array: 78445 framework rtti: 1439 func: 26529 group: 1 struct: 223090 ]
[c] 260000 nodes [ array: 78480 framework rtti: 1439 func: 26581 group: 1 struct: 223356 ]
[c] 261000 nodes [ array: 78486 framework rtti: 1440 func: 26586 group: 1 struct: 223711 ]
[c] 262000 nodes [ array: 78500 framework rtti: 1440 func: 26594 group: 1 struct: 224072 ]
[c] 263000 nodes [ array: 78579 framework rtti: 1440 func: 26621 group: 1 struct: 224328 ]
[c] 264000 nodes [ array: 78629 framework rtti: 1440 func: 26681 group: 1 struct: 224556 ]
[c] 265000 nodes [ array: 78659 framework rtti: 1440 func: 26691 group: 1 struct: 224878 ]
[c] 266000 nodes [ array: 78668 framework rtti: 1440 func: 26711 group: 1 struct: 225220 ]
[c] 267000 nodes [ array: 78699 framework rtti: 1440 func: 26745 group: 1 struct: 225430 ]
[c] 268000 nodes [ array: 78726 framework rtti: 1440 func: 26759 group: 1 struct: 225723 ]
[c] 269000 nodes [ array: 78777 framework rtti: 1440 func: 26810 group: 1 struct: 225964 ]
[c] 270000 nodes [ array: 78796 framework rtti: 1440 func: 26835 group: 1 struct: 226309 ]
[c] 271000 nodes [ array: 78833 framework rtti: 1440 func: 26855 group: 1 struct: 226641 ]
[c] 272000 nodes [ array: 78875 framework rtti: 1440 func: 26900 group: 1 struct: 226924 ]
[c] 273000 nodes [ array: 78912 framework rtti: 1440 func: 26907 group: 1 struct: 227238 ]
[c] 274000 nodes [ array: 78948 framework rtti: 1440 func: 26962 group: 1 struct: 227568 ]
[c] 275000 nodes [ array: 78951 framework rtti: 1440 func: 26962 group: 1 struct: 227904 ]
[c] 276000 nodes [ array: 78961 framework rtti: 1441 func: 26964 group: 1 struct: 228281 ]
[c] 277000 nodes [ array: 79005 framework rtti: 1441 func: 27166 group: 1 struct: 228867 ]
[c] 278000 nodes [ array: 79043 framework rtti: 1442 func: 27291 group: 1 struct: 229364 ]
[c] 279000 nodes [ array: 79085 framework rtti: 1447 func: 27614 group: 1 struct: 229890 ]
[c] 280000 nodes [ array: 79139 framework rtti: 1459 func: 27615 group: 1 struct: 230959 ]
[c] 281000 nodes [ array: 79156 framework rtti: 1592 func: 27842 group: 1 struct: 231097 ]
[c] 282000 nodes [ array: 79186 framework rtti: 1694 func: 28055 group: 1 struct: 231491 ]
[c] 283000 nodes [ array: 79331 framework rtti: 1708 func: 28098 group: 1 struct: 232287 ]
[c] 284000 nodes [ array: 79515 framework rtti: 1735 func: 28177 group: 1 struct: 233307 ]
[c] 285000 nodes [ array: 79714 framework rtti: 1768 func: 28386 group: 1 struct: 233920 ]
[c] 286000 nodes [ array: 79918 framework rtti: 1779 func: 28390 group: 1 struct: 234758 ]
[c] 287000 nodes [ array: 80114 framework rtti: 1784 func: 28420 group: 1 struct: 235328 ]
[c] 288000 nodes [ array: 80361 framework rtti: 1788 func: 28420 group: 1 struct: 235901 ]
[c] 289000 nodes [ array: 80372 framework rtti: 1788 func: 28420 group: 1 struct: 236067 ]
[c] 290000 nodes [ array: 80575 framework rtti: 1802 func: 28426 group: 1 struct: 236441 ]
[c] 291000 nodes [ array: 80871 framework rtti: 1823 func: 28428 group: 1 struct: 236828 ]
[c] 292000 nodes [ array: 80933 framework rtti: 1849 func: 28574 group: 1 struct: 237324 ]
[c] 293000 nodes [ array: 81034 framework rtti: 1849 func: 28581 group: 1 struct: 237834 ]
[c] 294000 nodes [ array: 81040 framework rtti: 1849 func: 28585 group: 1 struct: 240570 ]
[c] 295000 nodes [ array: 81040 framework rtti: 1849 func: 28586 group: 1 struct: 243044 ]
[c] 296000 nodes [ array: 81089 framework rtti: 1852 func: 28594 group: 1 struct: 244924 ]
[c] 297000 nodes [ array: 81113 framework rtti: 1853 func: 28594 group: 1 struct: 245500 ]
[c] 298000 nodes [ array: 81132 framework rtti: 1853 func: 28594 group: 1 struct: 245691 ]
[c] 299000 nodes [ array: 81179 framework rtti: 1853 func: 28594 group: 1 struct: 246072 ]
[c] 300000 nodes [ array: 81251 framework rtti: 1853 func: 28594 group: 1 struct: 246488 ]
[c] 301000 nodes [ array: 81329 framework rtti: 1853 func: 28594 group: 1 struct: 246776 ]
[c] 302000 nodes [ array: 81358 framework rtti: 1853 func: 28594 group: 1 struct: 247601 ]
[c] 303000 nodes [ array: 81421 framework rtti: 1853 func: 28594 group: 1 struct: 248349 ]
[c] 304000 nodes [ array: 81484 framework rtti: 1853 func: 28594 group: 1 struct: 249037 ]
[c] 305000 nodes [ array: 81508 framework rtti: 1853 func: 28594 group: 1 struct: 249604 ]
[c] 306000 nodes [ array: 81574 framework rtti: 1853 func: 28594 group: 1 struct: 250136 ]
[c] 307000 nodes [ array: 81601 framework rtti: 1853 func: 28594 group: 1 struct: 250771 ]
[c] 308000 nodes [ array: 81633 framework rtti: 1853 func: 28594 group: 1 struct: 251233 ]
[c] 309000 nodes [ array: 81642 framework rtti: 1853 func: 28594 group: 1 struct: 251916 ]
[c] 310000 nodes [ array: 81687 framework rtti: 1853 func: 28594 group: 1 struct: 252377 ]
[c] 311000 nodes [ array: 81697 framework rtti: 1853 func: 28594 group: 1 struct: 252968 ]
[c] 312000 nodes [ array: 81737 framework rtti: 1853 func: 28594 group: 1 struct: 253481 ]
[c] 313000 nodes [ array: 81782 framework rtti: 1853 func: 28594 group: 1 struct: 253945 ]
[c] 314000 nodes [ array: 81800 framework rtti: 1853 func: 28594 group: 1 struct: 254506 ]
[c] 315000 nodes [ array: 81847 framework rtti: 1853 func: 28594 group: 1 struct: 255046 ]
[c] 316000 nodes [ array: 81865 framework rtti: 1853 func: 28594 group: 1 struct: 255691 ]
[c] 317000 nodes [ array: 81881 framework rtti: 1853 func: 28594 group: 1 struct: 256387 ]
[c] 318000 nodes [ array: 81914 framework rtti: 1853 func: 28594 group: 1 struct: 256934 ]
[c] 319000 nodes [ array: 81929 framework rtti: 1853 func: 28594 group: 1 struct: 257661 ]
[c] 320000 nodes [ array: 81954 framework rtti: 1853 func: 28594 group: 1 struct: 258150 ]
[c] 321000 nodes [ array: 81959 framework rtti: 1853 func: 28594 group: 1 struct: 258889 ]
[c] 322000 nodes [ array: 81959 framework rtti: 1853 func: 28594 group: 1 struct: 259721 ]
[c] 323000 nodes [ array: 81971 framework rtti: 1853 func: 28594 group: 1 struct: 260429 ]
[c] 324000 nodes [ array: 81972 framework rtti: 1853 func: 28594 group: 1 struct: 261141 ]
[c] 325000 nodes [ array: 81975 framework rtti: 1853 func: 28594 group: 1 struct: 262005 ]
[c] 326000 nodes [ array: 82000 framework rtti: 1853 func: 28594 group: 1 struct: 262697 ]
[c] 327000 nodes [ array: 82003 framework rtti: 1853 func: 28596 group: 1 struct: 263040 ]
[c] 328000 nodes [ array: 82003 framework rtti: 1853 func: 28598 group: 1 struct: 263062 ]
[c] 329000 nodes [ array: 82024 framework rtti: 1853 func: 28611 group: 1 struct: 263116 ]
[c] 330000 nodes [ array: 82105 framework rtti: 1853 func: 28637 group: 1 struct: 263213 ]
[c] 331000 nodes [ array: 82118 framework rtti: 1853 func: 28655 group: 1 struct: 265862 ]
[c] 332000 nodes [ array: 82157 framework rtti: 1853 func: 28670 group: 1 struct: 265978 ]
[c] 333000 nodes [ array: 82217 framework rtti: 1854 func: 28705 group: 1 struct: 266083 ]
[c] 334000 nodes [ array: 82281 framework rtti: 1854 func: 28725 group: 1 struct: 266227 ]
[c] 335000 nodes [ array: 82355 framework rtti: 1855 func: 28754 group: 1 struct: 266347 ]
[c] 336000 nodes [ array: 82407 framework rtti: 1858 func: 28768 group: 1 struct: 266387 ]
[c] 337000 nodes [ array: 82489 framework rtti: 1906 func: 28941 group: 1 struct: 266578 ]
[c] 338000 nodes [ array: 82747 framework rtti: 1917 func: 29074 group: 1 struct: 266732 ]
[c] 339000 nodes [ array: 82934 framework rtti: 1919 func: 29074 group: 1 struct: 267487 ]
[c] 340000 nodes [ array: 83194 framework rtti: 1919 func: 29074 group: 1 struct: 267572 ]
[c] 341000 nodes [ array: 83288 framework rtti: 1932 func: 29295 group: 1 struct: 268253 ]
[c] 342000 nodes [ array: 83382 framework rtti: 1938 func: 29380 group: 1 struct: 268875 ]
[c] 343000 nodes [ array: 83538 framework rtti: 1940 func: 29434 group: 1 struct: 269624 ]
[c] 344000 nodes [ array: 83635 framework rtti: 1940 func: 29491 group: 1 struct: 270068 ]
[c] 345000 nodes [ array: 83778 framework rtti: 1943 func: 29491 group: 1 struct: 270618 ]
[c] 346000 nodes [ array: 83902 framework rtti: 1946 func: 29498 group: 1 struct: 270907 ]
[c] 347000 nodes [ array: 83969 framework rtti: 1950 func: 29498 group: 1 struct: 271321 ]
[c] 348000 nodes [ array: 84078 framework rtti: 1958 func: 29500 group: 1 struct: 271579 ]
[c] 349000 nodes [ array: 84158 framework rtti: 1973 func: 29603 group: 1 struct: 272111 ]
[c] 350000 nodes [ array: 84272 framework rtti: 1973 func: 29606 group: 1 struct: 273404 ]
[c] 351000 nodes [ array: 84501 framework rtti: 1973 func: 29606 group: 1 struct: 273998 ]
[c] 352000 nodes [ array: 84719 framework rtti: 1973 func: 29607 group: 1 struct: 274529 ]
[c] 353000 nodes [ array: 84942 framework rtti: 1973 func: 29607 group: 1 struct: 275109 ]
[c] 354000 nodes [ array: 85095 framework rtti: 1973 func: 29607 group: 1 struct: 276127 ]
[c] 355000 nodes [ array: 85316 framework rtti: 1973 func: 29607 group: 1 struct: 276502 ]
[c] 356000 nodes [ array: 85471 framework rtti: 1973 func: 29608 group: 1 struct: 277561 ]
[c] 357000 nodes [ array: 85635 framework rtti: 1978 func: 29614 group: 1 struct: 277978 ]
[c] 358000 nodes [ array: 85636 framework rtti: 1979 func: 29615 group: 1 struct: 278485 ]
[c] 359000 nodes [ array: 85637 framework rtti: 1979 func: 29615 group: 1 struct: 278977 ]
[c] 360000 nodes [ array: 85637 framework rtti: 1979 func: 29615 group: 1 struct: 279459 ]
[c] 361000 nodes [ array: 85638 framework rtti: 1979 func: 29615 group: 1 struct: 279926 ]
[c] 362000 nodes [ array: 85638 framework rtti: 1979 func: 29615 group: 1 struct: 280392 ]
[c] 363000 nodes [ array: 85638 framework rtti: 1979 func: 29615 group: 1 struct: 280892 ]
[c] 364000 nodes [ array: 85638 framework rtti: 1979 func: 29615 group: 1 struct: 281400 ]
[c] 365000 nodes [ array: 85645 framework rtti: 1979 func: 29615 group: 1 struct: 281889 ]
[c] 366000 nodes [ array: 85648 framework rtti: 1979 func: 29615 group: 1 struct: 282421 ]
[c] 367000 nodes [ array: 85652 framework rtti: 1979 func: 29615 group: 1 struct: 282903 ]
[c] 368000 nodes [ array: 85655 framework rtti: 1979 func: 29615 group: 1 struct: 283393 ]
[c] 369000 nodes [ array: 85659 framework rtti: 1979 func: 29615 group: 1 struct: 283894 ]
[c] 370000 nodes [ array: 85659 framework rtti: 1979 func: 29615 group: 1 struct: 284383 ]
[c] 371000 nodes [ array: 85663 framework rtti: 1979 func: 29615 group: 1 struct: 284899 ]
[c] 372000 nodes [ array: 85671 framework rtti: 1979 func: 29615 group: 1 struct: 285427 ]
[c] 373000 nodes [ array: 85671 framework rtti: 1979 func: 29615 group: 1 struct: 285969 ]
[c] 374000 nodes [ array: 85671 framework rtti: 1979 func: 29615 group: 1 struct: 286516 ]
[c] 375000 nodes [ array: 85671 framework rtti: 1979 func: 29615 group: 1 struct: 287027 ]
[c] 376000 nodes [ array: 85723 framework rtti: 1985 func: 29644 group: 1 struct: 287462 ]
[c] 377000 nodes [ array: 85723 framework rtti: 1985 func: 29644 group: 1 struct: 287740 ]
[c] 378000 nodes [ array: 85723 framework rtti: 1985 func: 29644 group: 1 struct: 287894 ]
[c] 379000 nodes [ array: 85825 framework rtti: 1995 func: 29700 group: 1 struct: 288395 ]
[c] 380000 nodes [ array: 85918 framework rtti: 2008 func: 29819 group: 1 struct: 288911 ]
[c] 381000 nodes [ array: 86131 framework rtti: 2008 func: 29848 group: 1 struct: 289265 ]
[c] 382000 nodes [ array: 86172 framework rtti: 2015 func: 29976 group: 1 struct: 291669 ]
[c] 383000 nodes [ array: 86352 framework rtti: 2020 func: 30262 group: 1 struct: 293666 ]
[c] 384000 nodes [ array: 86569 framework rtti: 2025 func: 30379 group: 1 struct: 294225 ]
[c] 385000 nodes [ array: 86710 framework rtti: 2037 func: 30380 group: 1 struct: 294525 ]
[c] 386000 nodes [ array: 86894 framework rtti: 2054 func: 30380 group: 1 struct: 294894 ]
[c] 387000 nodes [ array: 87034 framework rtti: 2145 func: 30381 group: 1 struct: 295241 ]
[c] 388000 nodes [ array: 87108 framework rtti: 2172 func: 30438 group: 1 struct: 295651 ]
[c] 389000 nodes [ array: 87130 framework rtti: 2172 func: 30445 group: 1 struct: 296520 ]
[c] 390000 nodes [ array: 87141 framework rtti: 2172 func: 30450 group: 1 struct: 297247 ]
[c] 391000 nodes [ array: 87197 framework rtti: 2172 func: 30454 group: 1 struct: 297635 ]
[c] 392000 nodes [ array: 87210 framework rtti: 2172 func: 30456 group: 1 struct: 298274 ]
[c] 393000 nodes [ array: 87224 framework rtti: 2172 func: 30475 group: 1 struct: 298915 ]
[c] 394000 nodes [ array: 87234 framework rtti: 2172 func: 30476 group: 1 struct: 299498 ]
[c] 395000 nodes [ array: 87298 framework rtti: 2172 func: 30478 group: 1 struct: 300095 ]
[c] 396000 nodes [ array: 87376 framework rtti: 2172 func: 30478 group: 1 struct: 301016 ]
[c] 397000 nodes [ array: 87440 framework rtti: 2172 func: 30478 group: 1 struct: 301952 ]
[c] 398000 nodes [ array: 87442 framework rtti: 2172 func: 30478 group: 1 struct: 302942 ]
[c] 399000 nodes [ array: 87476 framework rtti: 2172 func: 30478 group: 1 struct: 303901 ]
[c] 400000 nodes [ array: 87571 framework rtti: 2172 func: 30478 group: 1 struct: 304799 ]
[c] 401000 nodes [ array: 87600 framework rtti: 2172 func: 30478 group: 1 struct: 305767 ]
[c] 402000 nodes [ array: 87602 framework rtti: 2172 func: 30478 group: 1 struct: 306758 ]
[c] 403000 nodes [ array: 87615 framework rtti: 2172 func: 30478 group: 1 struct: 307737 ]
[c] 404000 nodes [ array: 87635 framework rtti: 2172 func: 30478 group: 1 struct: 308717 ]
[c] 405000 nodes [ array: 87860 framework rtti: 2173 func: 30504 group: 1 struct: 309323 ]
[c] 406000 nodes [ array: 88462 framework rtti: 2189 func: 30530 group: 1 struct: 309424 ]
[c] 407000 nodes [ array: 88484 framework rtti: 2192 func: 30564 group: 1 struct: 309598 ]
[c] 408000 nodes [ array: 88790 framework rtti: 2194 func: 30741 group: 1 struct: 309764 ]
[c] 409000 nodes [ array: 89790 framework rtti: 2194 func: 30741 group: 1 struct: 309764 ]
[c] 410000 nodes [ array: 90363 framework rtti: 2195 func: 30842 group: 1 struct: 310075 ]
[c] 411000 nodes [ array: 90656 framework rtti: 2196 func: 30898 group: 1 struct: 310491 ]
[c] 412000 nodes [ array: 90700 framework rtti: 2197 func: 30911 group: 1 struct: 310936 ]
[c] 413000 nodes [ array: 90750 framework rtti: 2199 func: 30986 group: 1 struct: 311306 ]
[c] 414000 nodes [ array: 90767 framework rtti: 2200 func: 30986 group: 1 struct: 311977 ]
[c] 415000 nodes [ array: 90913 framework rtti: 2244 func: 31005 group: 1 struct: 312216 ]
[c] 416000 nodes [ array: 91226 framework rtti: 2258 func: 31055 group: 1 struct: 312763 ]
[c] 417000 nodes [ array: 91570 framework rtti: 2258 func: 31064 group: 1 struct: 313484 ]
[c] 418000 nodes [ array: 91873 framework rtti: 2258 func: 31074 group: 1 struct: 313933 ]
[c] 419000 nodes [ array: 92206 framework rtti: 2258 func: 31105 group: 1 struct: 314460 ]
[c] 420000 nodes [ array: 92509 framework rtti: 2258 func: 31107 group: 1 struct: 314971 ]
[c] 421000 nodes [ array: 92511 framework rtti: 2258 func: 31107 group: 1 struct: 315094 ]
[c] 422000 nodes [ array: 92511 framework rtti: 2258 func: 31107 group: 1 struct: 315158 ]
[c] 423000 nodes [ array: 92511 framework rtti: 2258 func: 31107 group: 1 struct: 315175 ]
[c] 424000 nodes [ array: 92511 framework rtti: 2258 func: 31107 group: 1 struct: 315224 ]
[c] 425000 nodes [ array: 92511 framework rtti: 2258 func: 31107 group: 1 struct: 315331 ]
[c] 426000 nodes [ array: 92511 framework rtti: 2258 func: 31107 group: 1 struct: 315367 ]
[c] 427000 nodes [ array: 92511 framework rtti: 2258 func: 31107 group: 1 struct: 315397 ]
[c] 428000 nodes [ array: 92511 framework rtti: 2258 func: 31107 group: 1 struct: 315410 ]
[c] 429000 nodes [ array: 92511 framework rtti: 2258 func: 31107 group: 1 struct: 315430 ]
[c] 430000 nodes [ array: 92519 framework rtti: 2259 func: 31121 group: 1 struct: 315477 ]
[c] 431000 nodes [ array: 92546 framework rtti: 2262 func: 31124 group: 1 struct: 315591 ]
[c] 432000 nodes [ array: 92558 framework rtti: 2263 func: 31246 group: 1 struct: 315658 ]
[c] 433000 nodes [ array: 92558 framework rtti: 2263 func: 31246 group: 1 struct: 315658 ]
[c] 434000 nodes [ array: 92792 framework rtti: 2268 func: 31475 group: 1 struct: 315920 ]
[c] 435000 nodes [ array: 92950 framework rtti: 2277 func: 31493 group: 1 struct: 316589 ]
[c] 436000 nodes [ array: 93084 framework rtti: 2285 func: 31523 group: 1 struct: 317024 ]
[c] 437000 nodes [ array: 93130 framework rtti: 2293 func: 31544 group: 1 struct: 317323 ]
[c] 438000 nodes [ array: 93165 framework rtti: 2293 func: 31553 group: 1 struct: 318184 ]
[c] 439000 nodes [ array: 93211 framework rtti: 2294 func: 31568 group: 1 struct: 318603 ]
[c] 440000 nodes [ array: 93236 framework rtti: 2295 func: 31589 group: 1 struct: 318892 ]
[c] 441000 nodes [ array: 93236 framework rtti: 2295 func: 31591 group: 1 struct: 319138 ]
[c] 442000 nodes [ array: 93285 framework rtti: 2296 func: 31917 group: 1 struct: 319512 ]
[c] 443000 nodes [ array: 93307 framework rtti: 2297 func: 32072 group: 1 struct: 320112 ]
[c] 444000 nodes [ array: 93336 framework rtti: 2300 func: 32114 group: 1 struct: 320489 ]
[c] 445000 nodes [ array: 93400 framework rtti: 2321 func: 32121 group: 1 struct: 320941 ]
[c] 446000 nodes [ array: 93562 framework rtti: 2368 func: 32140 group: 1 struct: 321333 ]
[c] 447000 nodes [ array: 93653 framework rtti: 2396 func: 32206 group: 1 struct: 321495 ]
[c] 448000 nodes [ array: 93686 framework rtti: 2397 func: 32306 group: 1 struct: 321680 ]
[c] 449000 nodes [ array: 93736 framework rtti: 2401 func: 32326 group: 1 struct: 321963 ]
[c] 450000 nodes [ array: 93853 framework rtti: 2407 func: 32403 group: 1 struct: 322470 ]
[c] 451000 nodes [ array: 93876 framework rtti: 2423 func: 32461 group: 1 struct: 322862 ]
[c] 452000 nodes [ array: 93926 framework rtti: 2428 func: 32612 group: 1 struct: 323533 ]
[c] 453000 nodes [ array: 93991 framework rtti: 2445 func: 32911 group: 1 struct: 323844 ]
[c] 454000 nodes [ array: 94044 framework rtti: 2461 func: 33319 group: 1 struct: 324503 ]
[c:database] GC transformer: finished helpers
[c] 455000 nodes [ array: 94315 framework rtti: 2468 func: 33434 group: 1 struct: 326621 ]
[c] 456000 nodes [ array: 94882 framework rtti: 2468 func: 33434 group: 1 struct: 326711 ]
[c] 457000 nodes [ array: 95090 framework rtti: 2492 func: 33538 group: 1 struct: 326963 ]
[c] 458000 nodes [ array: 95096 framework rtti: 2558 func: 33837 group: 1 struct: 327205 ]
[c] 459000 nodes [ array: 95227 framework rtti: 2662 func: 34104 group: 1 struct: 327635 ]
[c] 460000 nodes [ array: 95355 framework rtti: 2731 func: 34324 group: 1 struct: 327940 ]
[c] 461000 nodes [ array: 95508 framework rtti: 2771 func: 34526 group: 1 struct: 328272 ]
[rtyper] specializing: 308300 / 308654 blocks (99%)
[rtyper] -=- specialized 399 more blocks -=-
[backendopt:inlining] phase with threshold factor: 32.4
[backendopt:inlining] heuristic: rpython.translator.backendopt.inline.inlining_heuristic
[backendopt:inlining] inlined 14 callsites.
[backendopt:malloc] starting malloc removal
[backendopt:malloc] removed 16 simple mallocs in total
[backendopt:mergeifblocks] starting to merge if blocks
[c:database] GC transformer: finished tables
[gctransform:info] assigned 5906 typeids
[gctransform:info] added 145789 push/pop stack root instructions
[gctransform:info] inserted 6767 write barrier calls
[gctransform:info] inserted 7343 write_barrier_from_array calls
[gctransform:info] found 4 static roots
[c:database] Inlining GC helpers and postprocessing
[c] 461528 nodes [ array: 95651 framework rtti: 2780 func: 34670 group: 1 struct: 328426 ]
[c:database] Completed
[translation:info] database for generating C source was created
[translation:info] Generating c source...
[c:writing] structdef.h
[c:writing] forwarddecl.h
[c:writing] preimpl.h
[c:writing] data_pypy_goal.c
[c:writing] data_pypy_interpreter.c
[c:writing] data_pypy_interpreter_astcompiler.c
[c:writing] data_pypy_interpreter_pyparser.c
[c:writing] data_pypy_module___builtin__.c
[c:writing] data_pypy_module___pypy__.c
[c:writing] data_pypy_module__abc.c
[c:writing] data_pypy_module__cffi_backend.c
[c:writing] data_pypy_module__codecs.c
[c:writing] data_pypy_module__collections.c
[c:writing] data_pypy_module__continuation.c
[c:writing] data_pypy_module__csv.c
[c:writing] data_pypy_module__frozen_importlib.c
[c:writing] data_pypy_module__io.c
[c:writing] data_pypy_module__locale.c
[c:writing] data_pypy_module__lsprof.c
[c:writing] data_pypy_module__minimal_curses.c
[c:writing] data_pypy_module__multibytecodec.c
[c:writing] data_pypy_module__multiprocessing.c
[c:writing] data_pypy_module__opcode.c
[c:writing] data_pypy_module__pickle.c
[c:writing] data_pypy_module__posixsubprocess.c
[c:writing] data_pypy_module__pypyjson.c
[c:writing] data_pypy_module__random.c
[c:writing] data_pypy_module__rawffi.c
[c:writing] data_pypy_module__rawffi_alt.c
[c:writing] data_pypy_module__socket.c
[c:writing] data_pypy_module__sre.c
[c:writing] data_pypy_module__vmprof.c
[c:writing] data_pypy_module__warnings.c
[c:writing] data_pypy_module__weakref.c
[c:writing] data_pypy_module_array.c
[c:writing] data_pypy_module_binascii.c
[c:writing] data_pypy_module_bz2.c
[c:writing] data_pypy_module_cmath.c
[c:writing] data_pypy_module_cpyext.c
[c:writing] data_pypy_module_exceptions.c
[c:writing] data_pypy_module_faulthandler.c
[c:writing] data_pypy_module_fcntl.c
[c:writing] data_pypy_module_gc.c
[c:writing] data_pypy_module_imp.c
[c:writing] data_pypy_module_itertools.c
[c:writing] data_pypy_module_marshal.c
[c:writing] data_pypy_module_math.c
[c:writing] data_pypy_module_mmap.c
[c:writing] data_pypy_module_operator.c
[c:writing] data_pypy_module_posix.c
[c:writing] data_pypy_module_pwd.c
[c:writing] data_pypy_module_pyexpat.c
[c:writing] data_pypy_module_pypyjit.c
[c:writing] data_pypy_module_select.c
[c:writing] data_pypy_module_signal.c
[c:writing] data_pypy_module_struct.c
[c:writing] data_pypy_module_sys.c
[c:writing] data_pypy_module_termios.c
[c:writing] data_pypy_module_thread.c
[c:writing] data_pypy_module_time.c
[c:writing] data_pypy_module_unicodedata.c
[c:writing] data_pypy_module_zlib.c
[c:writing] data_pypy_objspace.c
[c:writing] data_pypy_objspace_std.c
[c:writing] data_rpython_flowspace.c
[c:writing] data_rpython_jit_backend.c
[c:writing] data_rpython_jit_backend_llsupport.c
[c:writing] data_rpython_jit_backend_x86.c
[c:writing] data_rpython_jit_codewriter.c
[c:writing] data_rpython_jit_metainterp.c
[c:writing] data_rpython_jit_metainterp_optimizeopt.c
[c:writing] data_rpython_memory_gc.c
[c:writing] data_rpython_memory_gctransform.c
[c:writing] data_rpython_rlib.c
[c:writing] data_rpython_rlib_rjitlog.c
[c:writing] data_rpython_rlib_rsre.c
[c:writing] data_rpython_rlib_rstruct.c
[c:writing] data_rpython_rlib_rvmprof.c
[c:writing] data_rpython_rlib_unicodedata.c
[c:writing] data_rpython_rlib_unicodedata_1.c
[c:writing] data_rpython_rlib_unicodedata_2.c
[c:writing] data_rpython_rlib_unicodedata_3.c
[c:writing] data_rpython_rtyper.c
[c:writing] data_rpython_rtyper_1.c
[c:writing] data_rpython_rtyper_lltypesystem.c
[c:writing] nonfuncnodes.c
[c:writing] nonfuncnodes_1.c
[c:writing] nonfuncnodes_2.c
[c:writing] nonfuncnodes_3.c
[c:writing] nonfuncnodes_4.c
[c:writing] nonfuncnodes_5.c
[c:writing] nonfuncnodes_6.c
[c:writing] nonfuncnodes_7.c
[c:writing] nonfuncnodes_8.c
[c:writing] nonfuncnodes_9.c
[c:writing] nonfuncnodes_10.c
[c:writing] nonfuncnodes_11.c
[c:writing] nonfuncnodes_12.c
[c:writing] nonfuncnodes_13.c
[c:writing] nonfuncnodes_14.c
[c:writing] nonfuncnodes_15.c
[c:writing] nonfuncnodes_16.c
[c:writing] nonfuncnodes_17.c
[c:writing] nonfuncnodes_18.c
[c:writing] nonfuncnodes_19.c
[c:writing] nonfuncnodes_20.c
[c:writing] nonfuncnodes_21.c
[c:writing] nonfuncnodes_22.c
[c:writing] nonfuncnodes_23.c
[c:writing] nonfuncnodes_24.c
[c:writing] nonfuncnodes_25.c
[c:writing] nonfuncnodes_26.c
[c:writing] nonfuncnodes_27.c
[c:writing] nonfuncnodes_28.c
[c:writing] nonfuncnodes_29.c
[c:writing] nonfuncnodes_30.c
[c:writing] nonfuncnodes_31.c
[c:writing] nonfuncnodes_32.c
[c:writing] nonfuncnodes_33.c
[c:writing] nonfuncnodes_34.c
[c:writing] data_pypy_interpreter_1.c
[c:writing] data_pypy_module___pypy___1.c
[c:writing] data_pypy_module__cffi_backend_1.c
[c:writing] data_pypy_module__codecs_1.c
[c:writing] data_pypy_module__continuation_1.c
[c:writing] data_pypy_module__locale_1.c
[c:writing] data_pypy_module__multibytecodec_1.c
[c:writing] data_pypy_module__multiprocessing_1.c
[c:writing] data_pypy_module_bz2_1.c
[c:writing] data_pypy_module_cpyext_1.c
[c:writing] data_pypy_module_faulthandler_1.c
[c:writing] data_pypy_module_math_1.c
[c:writing] data_pypy_module_posix_1.c
[c:writing] data_pypy_module_pwd_1.c
[c:writing] data_pypy_module_pyexpat_1.c
[c:writing] data_pypy_module_signal_1.c
[c:writing] data_pypy_module_sys_1.c
[c:writing] data_pypy_module_thread_1.c
[c:writing] data_pypy_module_time_1.c
[c:writing] data_pypy_module_zlib_1.c
[c:writing] data_pypy_objspace_std_1.c
[c:writing] data_rpython_jit_backend_llsupport_1.c
[c:writing] data_rpython_jit_backend_x86_1.c
[c:writing] data_rpython_jit_metainterp_1.c
[c:writing] data_rpython_memory_gc_1.c
[c:writing] data_rpython_rlib_1.c
[c:writing] data_rpython_rlib_rjitlog_1.c
[c:writing] data_rpython_rlib_rsre_1.c
[c:writing] data_rpython_rlib_rstruct_1.c
[c:writing] data_rpython_rlib_rvmprof_1.c
[c:writing] data_rpython_rtyper_lltypesystem_1.c
[c:writing] data_rpython_rtyper_lltypesystem_module.c
[c:writing] implement.c
[c:writing] implement_1.c
[c:writing] implement_2.c
[c:writing] implement_3.c
[c:writing] implement_4.c
[c:writing] implement_5.c
[c:writing] implement_6.c
[c:writing] implement_7.c
[c:writing] implement_8.c
[c:writing] implement_9.c
[c:writing] implement_10.c
[c:writing] implement_11.c
[c:writing] implement_12.c
[c:writing] implement_13.c
[c:writing] implement_14.c
[c:writing] pypy_goal.c
[c:writing] pypy_interpreter.c
[c:writing] pypy_interpreter_1.c
[c:writing] pypy_interpreter_2.c
[c:computedgoto] pypy_g__str_decode_utf8_slowpath: 5 cases
[c:writing] pypy_interpreter_3.c
[c:writing] pypy_interpreter_4.c
[c:computedgoto] pypy_g_dispatch_bytecode__AccessDirect_None: 136 cases
[c:computedgoto] pypy_g_COMPARE_OP__AccessDirect_None: 6 cases
[c:computedgoto] pypy_g_funccall_valuestack__AccessDirect_None: 5 cases
[c:writing] pypy_interpreter_5.c
[c:writing] pypy_interpreter_astcompiler.c
[c:writing] pypy_interpreter_astcompiler_1.c
[c:computedgoto] pypy_g_PythonCodeGenerator_name_op: 5 cases
[c:computedgoto] pypy_g__opcode_stack_effect: 136 cases
[c:computedgoto] pypy_g__apply_static_swaps: 5 cases
[c:computedgoto] pypy_g__next_swappable: 5 cases
[c:writing] pypy_interpreter_astcompiler_2.c
[c:computedgoto] pypy_g_visit_BinOp: 13 cases
[c:computedgoto] pypy_g_PythonCodeMaker_emit_compare: 10 cases
[c:computedgoto] pypy_g_PythonCodeGenerator_unwind_fblock: 11 cases
[c:writing] pypy_interpreter_astcompiler_3.c
[c:computedgoto] pypy_g_OptimizingVisitor_visit_BinOp: 13 cases
[c:writing] pypy_interpreter_astcompiler_4.c
[c:writing] pypy_interpreter_astcompiler_5.c
[c:computedgoto] pypy_g_PythonCodeGenerator_visit_AugAssign: 13 cases
[c:computedgoto] pypy_g_PythonCodeGenerator_visit_AugAssign: 13 cases
[c:computedgoto] pypy_g_PythonCodeGenerator_visit_AugAssign: 13 cases
[c:computedgoto] pypy_g_UnparseVisitor_visit_BinOp: 13 cases
[c:computedgoto] pypy_g_UnparseVisitor_visit_Compare: 10 cases
[c:writing] pypy_interpreter_pyparser.c
[c:writing] pypy_interpreter_pyparser_1.c
[c:writing] pypy_interpreter_pyparser_2.c
[c:writing] pypy_interpreter_pyparser_3.c
[c:writing] pypy_interpreter_pyparser_4.c
[c:writing] pypy_module___builtin__.c
[c:writing] pypy_module___pypy__.c
[c:writing] pypy_module__abc.c
[c:writing] pypy_module__cffi_backend.c
[c:computedgoto] pypy_g_W_LibObject__build_attr: 11 cases
[c:writing] pypy_module__cffi_backend_1.c
[c:computedgoto] pypy_g_realize_c_type_or_func_now: 9 cases
[c:writing] pypy_module__cffi_backend_2.c
[c:writing] pypy_module__codecs.c
[c:computedgoto] pypy_g_surrogatepass_errors: 5 cases
[c:computedgoto] pypy_g_surrogatepass_errors: 5 cases
[c:writing] pypy_module__collections.c
[c:writing] pypy_module__continuation.c
[c:writing] pypy_module__csv.c
[c:computedgoto] pypy_g_W_Reader_next_w: 7 cases
[c:computedgoto] pypy_g_W_Reader_next_w: 9 cases
[c:writing] pypy_module__frozen_importlib.c
[c:writing] pypy_module__io.c
[c:writing] pypy_module__io_1.c
[c:writing] pypy_module__jitlog.c
[c:writing] pypy_module__locale.c
[c:writing] pypy_module__lsprof.c
[c:writing] pypy_module__md5.c
[c:writing] pypy_module__minimal_curses.c
[c:writing] pypy_module__multibytecodec.c
[c:writing] pypy_module__multiprocessing.c
[c:writing] pypy_module__opcode.c
[c:writing] pypy_module__pickle.c
[c:writing] pypy_module__pickle_1.c
[c:writing] pypy_module__pickle_2.c
[c:writing] pypy_module__pickle_support.c
[c:writing] pypy_module__posixsubprocess.c
[c:writing] pypy_module__pypyjson.c
[c:writing] pypy_module__random.c
[c:writing] pypy_module__rawffi.c
[c:writing] pypy_module__rawffi_alt.c
[c:writing] pypy_module__socket.c
[c:writing] pypy_module__sre.c
[c:computedgoto] pypy_g__validate_inner: 5 cases
[c:computedgoto] pypy_g__validate_inner: 8 cases
[c:writing] pypy_module__string.c
[c:writing] pypy_module__vmprof.c
[c:writing] pypy_module__warnings.c
[c:writing] pypy_module__weakref.c
[c:writing] pypy_module_array.c
[c:computedgoto] pypy_g_portal_24: 5 cases
[c:computedgoto] pypy_g_compare_arrays_1: 5 cases
[c:computedgoto] pypy_g_array_reconstructor: 8 cases
[c:writing] pypy_module_binascii.c
[c:writing] pypy_module_bz2.c
[c:writing] pypy_module_cmath.c
[c:writing] pypy_module_cpyext.c
[c:writing] pypy_module_cpyext_1.c
[c:writing] pypy_module_cpyext_2.c
[c:writing] pypy_module_cpyext_3.c
[c:computedgoto] pypy_g_PyObject_RichCompare: 6 cases
[c:computedgoto] pypy_g_PyMember_GetOne: 19 cases
[c:computedgoto] pypy_g_PyMember_SetOne: 15 cases
[c:writing] pypy_module_cpyext_4.c
[c:computedgoto] pypy_g_get_slot_by_num: 81 cases
[c:writing] pypy_module_cpyext_5.c
[c:writing] pypy_module_cpyext_6.c
[c:writing] pypy_module_cpyext_7.c
[c:writing] pypy_module_cpyext_8.c
[c:writing] pypy_module_cpyext_9.c
[c:writing] pypy_module_cpyext_10.c
[c:writing] pypy_module_cpyext_11.c
[c:writing] pypy_module_exceptions.c
[c:writing] pypy_module_faulthandler.c
[c:writing] pypy_module_fcntl.c
[c:writing] pypy_module_gc.c
[c:writing] pypy_module_imp.c
[c:writing] pypy_module_itertools.c
[c:writing] pypy_module_marshal.c
[c:writing] pypy_module_math.c
[c:writing] pypy_module_mmap.c
[c:writing] pypy_module_operator.c
[c:writing] pypy_module_posix.c
[c:writing] pypy_module_pwd.c
[c:writing] pypy_module_pyexpat.c
[c:writing] pypy_module_pypyjit.c
[c:writing] pypy_module_select.c
[c:writing] pypy_module_signal.c
[c:writing] pypy_module_struct.c
[c:writing] pypy_module_sys.c
[c:writing] pypy_module_termios.c
[c:writing] pypy_module_thread.c
[c:writing] pypy_module_time.c
[c:writing] pypy_module_token.c
[c:writing] pypy_module_unicodedata.c
[c:writing] pypy_module_zipimport.c
[c:writing] pypy_module_zlib.c
[c:writing] pypy_objspace.c
[c:writing] pypy_objspace_std.c
[c:writing] pypy_objspace_std_1.c
[c:computedgoto] pypy_g_W_ObjectObjectUserDictWeakrefable__mapdict_pop_a: 5 cases
[c:writing] pypy_objspace_std_2.c
[c:writing] pypy_objspace_std_3.c
[c:writing] pypy_objspace_std_4.c
[c:writing] pypy_objspace_std_5.c
[c:writing] pypy_objspace_std_6.c
[c:writing] pypy_objspace_std_7.c
[c:writing] pypy_objspace_std_8.c
[c:writing] pypy_objspace_std_9.c
[c:writing] pypy_objspace_std_10.c
[c:writing] pypy_objspace_std_11.c
[c:writing] pypy_objspace_std_12.c
[c:writing] pypy_objspace_std_13.c
[c:writing] pypy_objspace_std_14.c
[c:writing] rpython_flowspace.c
[c:writing] rpython_jit_backend.c
[c:writing] rpython_jit_backend_llsupport.c
[c:computedgoto] pypy_g_GcRewriterAssembler_handle_malloc_operation: 6 cases
[c:writing] rpython_jit_backend_llsupport_1.c
[c:writing] rpython_jit_backend_x86.c
[c:writing] rpython_jit_backend_x86_1.c
[c:writing] rpython_jit_backend_x86_2.c
[c:writing] rpython_jit_backend_x86_3.c
[c:writing] rpython_jit_backend_x86_4.c
[c:writing] rpython_jit_codewriter.c
[c:writing] rpython_jit_metainterp.c
[c:writing] rpython_jit_metainterp_1.c
[c:writing] rpython_jit_metainterp_2.c
[c:computedgoto] pypy_g_dispatch_loop: 237 cases
[c:writing] rpython_jit_metainterp_3.c
[c:writing] rpython_jit_metainterp_4.c
[c:writing] rpython_jit_metainterp_5.c
[c:writing] rpython_jit_metainterp_6.c
[c:writing] rpython_jit_metainterp_7.c
[c:writing] rpython_jit_metainterp_8.c
[c:writing] rpython_jit_metainterp_9.c
[c:computedgoto] pypy_g_HeapCache_clear_caches_not_necessary: 15 cases
[c:computedgoto] pypy_g_HeapCache_clear_caches_varargs: 11 cases
[c:writing] rpython_jit_metainterp_10.c
[c:computedgoto] pypy_g_execute_nonspec_const: 254 cases
[c:writing] rpython_jit_metainterp_11.c
[c:writing] rpython_jit_metainterp_12.c
[c:writing] rpython_jit_metainterp_optimizeopt.c
[c:writing] rpython_jit_metainterp_optimizeopt_1.c
[c:computedgoto] pypy_g_DependencyGraph_build_non_pure_dependencies: 18 cases
[c:computedgoto] pypy_g_Node_side_effect_arguments: 11 cases
[c:writing] rpython_jit_metainterp_optimizeopt_2.c
[c:computedgoto] pypy_g_Optimizer_protect_speculative_operation: 8 cases
[c:computedgoto] pypy_g_OptHeap_check_postprocess_: 6 cases
[c:computedgoto] pypy_g_dispatch_postprocess___star_0: 6 cases
[c:writing] rpython_jit_metainterp_optimizeopt_3.c
[c:computedgoto] pypy_g_OptString_optimize_CALL_I: 8 cases
[c:writing] rpython_jit_metainterp_optimizeopt_4.c
[c:writing] rpython_jit_metainterp_optimizeopt_5.c
[c:writing] rpython_jit_metainterp_optimizeopt_6.c
[c:writing] rpython_memory.c
[c:writing] rpython_memory_gc.c
[c:computedgoto] pypy_g_IncrementalMiniMarkGC_get_stats: 12 cases
[c:writing] rpython_memory_gctransform.c
[c:writing] rpython_rlib.c
[c:computedgoto] pypy_g__siphash24_with_key___1: 8 cases
[c:writing] rpython_rlib_1.c
[c:writing] rpython_rlib_2.c
[c:computedgoto] pypy_g__sinpi: 5 cases
[c:writing] rpython_rlib_3.c
[c:computedgoto] pypy_g_isspace_2: 6 cases
[c:writing] rpython_rlib_4.c
[c:computedgoto] pypy_g__siphash24_with_key___4: 8 cases
[c:writing] rpython_rlib_rjitlog.c
[c:writing] rpython_rlib_rsre.c
[c:computedgoto] pypy_g_StrMatchContext_str_spec_sre_match: 37 cases
[c:computedgoto] pypy_g_BufMatchContext_buf_spec_sre_match: 37 cases
[c:computedgoto] pypy_g_Utf8MatchContext_utf8_spec_sre_match: 37 cases
[c:computedgoto] pypy_g_MinRepeatOneMatchResult_next_char_ok: 14 cases
[c:computedgoto] pypy_g_StrMatchContext_str_spec_sre_at: 12 cases
[c:computedgoto] pypy_g_category_dispatch: 18 cases
[c:computedgoto] pypy_g_StrMatchContext_str_spec_find_repetition_end: 14 cases
[c:computedgoto] pypy_g_StrMatchContext_str_spec_find_repetition_end: 14 cases
[c:computedgoto] pypy_g_BufMatchContext_buf_spec_sre_at: 12 cases
[c:computedgoto] pypy_g_BufMatchContext_buf_spec_find_repetition_end: 14 cases
[c:computedgoto] pypy_g_BufMatchContext_buf_spec_find_repetition_end: 14 cases
[c:computedgoto] pypy_g_Utf8MatchContext_utf8_spec_sre_at: 12 cases
[c:computedgoto] pypy_g_Utf8MatchContext_utf8_spec_find_repetition_end: 14 cases
[c:computedgoto] pypy_g_Utf8MatchContext_utf8_spec_find_repetition_end: 14 cases
[c:writing] rpython_rlib_rstruct.c
[c:writing] rpython_rlib_rvmprof.c
[c:writing] rpython_rlib_unicodedata.c
[c:computedgoto] pypy_g__charcode_to_pos: 5 cases
[c:computedgoto] pypy_g__charcode_to_pos: 5 cases
[c:computedgoto] pypy_g__charcode_to_pos_1: 5 cases
[c:computedgoto] pypy_g__charcode_to_pos_1: 7 cases
[c:computedgoto] pypy_g__charcode_to_pos_1: 8 cases
[c:writing] rpython_rtyper.c
[c:computedgoto] pypy_g_str_decode_utf8__SomeString: 5 cases
[c:writing] rpython_rtyper_lltypesystem.c
[c:writing] rpython_rtyper_lltypesystem_1.c
[c:writing] rpython_rtyper_lltypesystem_2.c
[c:writing] rpython_rtyper_lltypesystem_3.c
[c:writing] rpython_rtyper_lltypesystem_4.c
[c:writing] rpython_rtyper_lltypesystem_module.c
[c:writing] rpython_translator.c
[c:writing] rpython_translator_c.c
[translation:info] written: /tmp/buildbot-x86_64/usession-py3.12-740/testing_1/testing_1.c
[translation:info] Compiling c source...
[platform:execute] make -j 8 in /tmp/buildbot-x86_64/usession-py3.12-740/testing_1
[platform:WARNING] implement_5.c:21570:46: warning: passing 'unsigned int *' to parameter of type 'int *' converts between pointers to integer types with different sign [-Wpointer-sign]
[platform:WARNING] 21570 | l_v119021 = getgrouplist(l_a0_107, l_a1_76, l_a2_43, l_a3_18);
[platform:WARNING] | ^~~~~~~
[platform:WARNING] /Applications/Xcode.app/Contents/Developer/Platforms/MacOSX.platform/Developer/SDKs/MacOSX.sdk/usr/include/unistd.h:654:43: note: passing argument to parameter here
[platform:WARNING] 654 | int getgrouplist(const char *, int, int *, int *);
[platform:WARNING] | ^
[platform:WARNING] 1 warning generated.
[platform:WARNING] implement_14.c:15343:53: warning: incompatible pointer types passing 'Signed *' (aka 'long *') to parameter of type 'off_t *' (aka 'long long *') [-Wincompatible-pointer-types]
[platform:WARNING] 15343 | l_v313726 = sendfile(l_a0_389, l_a1_274, l_a2_153, l_a3_72, l_a4_41, l_a5_21);
[platform:WARNING] | ^~~~~~~
[platform:WARNING] /Applications/Xcode.app/Contents/Developer/Platforms/MacOSX.platform/Developer/SDKs/MacOSX.sdk/usr/include/sys/socket.h:733:42: note: passing argument to parameter here
[platform:WARNING] 733 | int sendfile(int, int, off_t, off_t *, struct sf_hdtr *, int);
[platform:WARNING] | ^
[platform:WARNING] 1 warning generated.
[platform:WARNING] pypy_module__cffi_backend.c:25105:14: warning: assigning to 'struct _cffi_field_s *' from 'const struct _cffi_field_s *' discards qualifiers [-Wincompatible-pointer-types-discards-qualifiers]
[platform:WARNING] 25105 | l_v698280 = RPyField(l_v698279, fields);
[platform:WARNING] | ^ ~~~~~~~~~~~~~~~~~~~~~~~~~~~
[platform:WARNING] pypy_module__cffi_backend.c:30200:12: warning: assigning to 'struct _cffi_global_s *' from 'const struct _cffi_global_s *' discards qualifiers [-Wincompatible-pointer-types-discards-qualifiers]
[platform:WARNING] 30200 | l_v700083 = RPyField(l_v700081, globals);
[platform:WARNING] | ^ ~~~~~~~~~~~~~~~~~~~~~~~~~~~~
[platform:WARNING] pypy_module__cffi_backend_1.c:11846:13: warning: assigning to 'struct _cffi_global_s *' from 'const struct _cffi_global_s *' discards qualifiers [-Wincompatible-pointer-types-discards-qualifiers]
[platform:WARNING] 11846 | l_v716018 = RPyField(l_v716017, globals);
[platform:WARNING] | ^ ~~~~~~~~~~~~~~~~~~~~~~~~~~~~
[platform:WARNING] pypy_module__cffi_backend_1.c:20719:12: warning: assigning to 'struct _cffi_typename_s *' from 'const struct _cffi_typename_s *' discards qualifiers [-Wincompatible-pointer-types-discards-qualifiers]
[platform:WARNING] 20719 | l_v718839 = RPyField(l_v718838, typenames);
[platform:WARNING] | ^ ~~~~~~~~~~~~~~~~~~~~~~~~~~~~~~
[platform:WARNING] pypy_module__cffi_backend.c:60799:12: warning: assigning to 'struct _cffi_global_s *' from 'const struct _cffi_global_s *' discards qualifiers [-Wincompatible-pointer-types-discards-qualifiers]
[platform:WARNING] 60799 | l_v710321 = RPyField(l_v710302, globals);
[platform:WARNING] | ^ ~~~~~~~~~~~~~~~~~~~~~~~~~~~~
[platform:WARNING] pypy_module__cffi_backend.c:62168:12: warning: assigning to 'struct _cffi_global_s *' from 'const struct _cffi_global_s *' discards qualifiers [-Wincompatible-pointer-types-discards-qualifiers]
[platform:WARNING] 62168 | l_v710865 = RPyField(l_v710863, globals);
[platform:WARNING] | ^ ~~~~~~~~~~~~~~~~~~~~~~~~~~~~
[platform:WARNING] pypy_module__cffi_backend_1.c:48610:12: warning: assigning to 'struct _cffi_struct_union_s *' from 'const struct _cffi_struct_union_s *' discards qualifiers [-Wincompatible-pointer-types-discards-qualifiers]
[platform:WARNING] 48610 | l_v727961 = RPyField(l_v727960, struct_unions);
[platform:WARNING] | ^ ~~~~~~~~~~~~~~~~~~~~~~~~~~~~~~~~~~
[platform:WARNING] pypy_module__cffi_backend_1.c:50256:12: warning: assigning to 'struct _cffi_enum_s *' from 'const struct _cffi_enum_s *' discards qualifiers [-Wincompatible-pointer-types-discards-qualifiers]
[platform:WARNING] 50256 | l_v728555 = RPyField(l_v728554, enums);
[platform:WARNING] | ^ ~~~~~~~~~~~~~~~~~~~~~~~~~~
[platform:WARNING] pypy_module__cffi_backend_1.c:50258:12: warning: assigning to 'struct _cffi_global_s *' from 'const struct _cffi_global_s *' discards qualifiers [-Wincompatible-pointer-types-discards-qualifiers]
[platform:WARNING] 50258 | l_v728556 = RPyField(l_v728554, globals);
[platform:WARNING] | ^ ~~~~~~~~~~~~~~~~~~~~~~~~~~~~
[platform:WARNING] pypy_module__cffi_backend_1.c:55073:12: warning: assigning to 'struct _cffi_typename_s *' from 'const struct _cffi_typename_s *' discards qualifiers [-Wincompatible-pointer-types-discards-qualifiers]
[platform:WARNING] 55073 | l_v730141 = RPyField(l_ctx_258, typenames);
[platform:WARNING] | ^ ~~~~~~~~~~~~~~~~~~~~~~~~~~~~~~
[platform:WARNING] pypy_module__cffi_backend_1.c:55731:12: warning: assigning to 'struct _cffi_struct_union_s *' from 'const struct _cffi_struct_union_s *' discards qualifiers [-Wincompatible-pointer-types-discards-qualifiers]
[platform:WARNING] 55731 | l_v730318 = RPyField(l_ctx_258, struct_unions);
[platform:WARNING] | ^ ~~~~~~~~~~~~~~~~~~~~~~~~~~~~~~~~~~
[platform:WARNING] pypy_module__cffi_backend_1.c:57214:12: warning: assigning to 'struct _cffi_global_s *' from 'const struct _cffi_global_s *' discards qualifiers [-Wincompatible-pointer-types-discards-qualifiers]
[platform:WARNING] 57214 | l_v730882 = RPyField(l_ctx_259, globals);
[platform:WARNING] | ^ ~~~~~~~~~~~~~~~~~~~~~~~~~~~~
[platform:WARNING] pypy_module__cffi_backend_1.c:62572:13: warning: assigning to 'struct _cffi_struct_union_s *' from 'const struct _cffi_struct_union_s *' discards qualifiers [-Wincompatible-pointer-types-discards-qualifiers]
[platform:WARNING] 62572 | l_v732956 = RPyField(l_ctx1_0, struct_unions);
[platform:WARNING] | ^ ~~~~~~~~~~~~~~~~~~~~~~~~~~~~~~~~~
[platform:WARNING] 4 warnings generated.
[platform:WARNING] 9 warnings generated.
[platform:WARNING] pypy_module__multibytecodec.c:10477:12: warning: assigning to 'struct MultibyteCodec_s *' from 'const MultibyteCodec *' (aka 'const struct MultibyteCodec_s *') discards qualifiers [-Wincompatible-pointer-types-discards-qualifiers]
[platform:WARNING] 10477 | l_codec_6 = pypy_cjk_enc_getcodec(l_encodebuf_8);
[platform:WARNING] | ^ ~~~~~~~~~~~~~~~~~~~~~~~~~~~~~~~~~~~~
[platform:WARNING] 1 warning generated.
[platform:WARNING] rpython_rtyper_lltypesystem_1.c:52562:46: warning: incompatible pointer types passing 'Signed *' (aka 'long *') to parameter of type '_PyTime_t *' (aka 'long long *') [-Wincompatible-pointer-types]
[platform:WARNING] 52562 | l_res_4142 = _PyTime_GetSystemClockWithInfo(l_stararg0_2857, l_stararg1_1646);
[platform:WARNING] | ^~~~~~~~~~~~~~~
[platform:WARNING] /Users/matti/build-worker-x86_64/pypy-c-jit-macos-x86-64/build/rpython/../pypy/module/cpyext/include/pytime.h:253:16: note: passing argument to parameter 't' here
[platform:WARNING] 253 | _PyTime_t *t,
[platform:WARNING] | ^
[platform:WARNING] rpython_rtyper_lltypesystem_1.c:52641:49: warning: incompatible pointer types passing 'Signed *' (aka 'long *') to parameter of type '_PyTime_t *' (aka 'long long *') [-Wincompatible-pointer-types]
[platform:WARNING] 52641 | l_res_4143 = _PyTime_GetMonotonicClockWithInfo(l_stararg0_2858, l_stararg1_1647);
[platform:WARNING] | ^~~~~~~~~~~~~~~
[platform:WARNING] /Users/matti/build-worker-x86_64/pypy-c-jit-macos-x86-64/build/rpython/../pypy/module/cpyext/include/pytime.h:277:16: note: passing argument to parameter 't' here
[platform:WARNING] 277 | _PyTime_t *t,
[platform:WARNING] | ^
[platform:WARNING] rpython_rtyper_lltypesystem_1.c:52720:46: warning: incompatible pointer types passing 'Signed *' (aka 'long *') to parameter of type '_PyTime_t *' (aka 'long long *') [-Wincompatible-pointer-types]
[platform:WARNING] 52720 | l_res_4144 = _PyTime_GetPerfCounterWithInfo(l_stararg0_2859, l_stararg1_1648);
[platform:WARNING] | ^~~~~~~~~~~~~~~
[platform:WARNING] /Users/matti/build-worker-x86_64/pypy-c-jit-macos-x86-64/build/rpython/../pypy/module/cpyext/include/pytime.h:306:16: note: passing argument to parameter 't' here
[platform:WARNING] 306 | _PyTime_t *t,
[platform:WARNING] | ^
[platform:WARNING] 3 warnings generated.
[translation:info] copied: /tmp/buildbot-x86_64/usession-py3.12-740/testing_1/pypy3.12-c to /Users/matti/build-worker-x86_64/pypy-c-jit-macos-x86-64/build/pypy/goal/pypy3.12-c
[translation:info] copied: /tmp/buildbot-x86_64/usession-py3.12-740/testing_1/libpypy3.12-c.dylib to /Users/matti/build-worker-x86_64/pypy-c-jit-macos-x86-64/build/pypy/goal/libpypy3.12-c.dylib
[translation:info] created: /Users/matti/build-worker-x86_64/pypy-c-jit-macos-x86-64/build/pypy/goal/pypy3.12-c
[translation:info] Create cffi bindings for modules...
calling create_cffi_import_libraries with "embed_dependencies" False
stdout:
generating ./_pypy_openssl.c
the current directory is '/Users/matti/build-worker-x86_64/pypy-c-jit-macos-x86-64/build/lib_pypy'
clang -fPIC -I/Users/matti/build-worker-x86_64/pypy-c-jit-macos-x86-64/build/include/pypy3.12 -I/opt/homebrew_x86_64/opt/openssl@3/include -fPIC -I/Users/matti/build-worker-x86_64/pypy-c-jit-macos-x86-64/build/include/pypy3.12 -I/usr/local/include -c _pypy_openssl.c -o _pypy_openssl.o
clang -shared -Wl,-headerpad_max_install_names -L/opt/homebrew_x86_64/opt/openssl@3/lib _pypy_openssl.o -lssl -lcrypto -L/usr/local/lib -o _pypy_openssl.pypy312-pp80-darwin.so
stderr:
stdout:
stderr:
Traceback (most recent call last):
File "/Users/matti/build-worker-x86_64/pypy-c-jit-macos-x86-64/build/lib_pypy/_sqlite3_build.py", line 630, in <module>
_ffi.compile(tmpdir=os.path.dirname(os.path.abspath(__file__)))
^^^^^^^
File "/Users/matti/build-worker-x86_64/pypy-c-jit-macos-x86-64/build/lib_pypy/cffi/api.py", line 720, in compile
return recompile(self, module_name, source, tmpdir=tmpdir,
^^^^^^^^^^^^^^^^^^^^^^^^^^^^^^^^^^^^^^^^^^^^^^^^^^^
File "/Users/matti/build-worker-x86_64/pypy-c-jit-macos-x86-64/build/lib_pypy/cffi/recompiler.py", line 1569, in recompile
outputfilename = ffiplatform.compile('.', ext,
^^^^^^^
File "/Users/matti/build-worker-x86_64/pypy-c-jit-macos-x86-64/build/lib_pypy/cffi/ffiplatform.py", line 48, in compile
outputfilename = backend.build(ext, tmpdir, compiler_verbose, debug)
^^^^^
File "/Users/matti/build-worker-x86_64/pypy-c-jit-macos-x86-64/build/lib_pypy/pypy_tools/_cffi_compile.py", line 227, in build
return _build_unix(ext, compiler_verbose)
^^^^^^^^^^^^^^^^^^^^^^^^^^^^^^^^^^
File "/Users/matti/build-worker-x86_64/pypy-c-jit-macos-x86-64/build/lib_pypy/pypy_tools/_cffi_compile.py", line 168, in _build_unix
_run(args, verbose)
File "/Users/matti/build-worker-x86_64/pypy-c-jit-macos-x86-64/build/lib_pypy/pypy_tools/_cffi_compile.py", line 111, in _run
raise VerificationError(
cffi.VerificationError: ld: warning: ignoring file '/opt/homebrew_x86_64/Cellar/sqlite/3.51.2_1/lib/libsqlite3.3.51.2.dylib': found architecture 'arm64', required architecture 'x86_64'
Undefined symbols for architecture x86_64:
"_sqlite3_aggregate_context", referenced from:
__cffi_d_sqlite3_aggregate_context in _sqlite3_cffi.o
"_sqlite3_backup_finish", referenced from:
__cffi_d_sqlite3_backup_finish in _sqlite3_cffi.o
"_sqlite3_backup_init", referenced from:
__cffi_d_sqlite3_backup_init in _sqlite3_cffi.o
"_sqlite3_backup_pagecount", referenced from:
__cffi_d_sqlite3_backup_pagecount in _sqlite3_cffi.o
"_sqlite3_backup_remaining", referenced from:
__cffi_d_sqlite3_backup_remaining in _sqlite3_cffi.o
"_sqlite3_backup_step", referenced from:
__cffi_d_sqlite3_backup_step in _sqlite3_cffi.o
"_sqlite3_bind_blob", referenced from:
__cffi_d_sqlite3_bind_blob in _sqlite3_cffi.o
"_sqlite3_bind_double", referenced from:
__cffi_d_sqlite3_bind_double in _sqlite3_cffi.o
"_sqlite3_bind_int", referenced from:
__cffi_d_sqlite3_bind_int in _sqlite3_cffi.o
"_sqlite3_bind_int64", referenced from:
__cffi_d_sqlite3_bind_int64 in _sqlite3_cffi.o
"_sqlite3_bind_null", referenced from:
__cffi_d_sqlite3_bind_null in _sqlite3_cffi.o
"_sqlite3_bind_parameter_count", referenced from:
__cffi_d_sqlite3_bind_parameter_count in _sqlite3_cffi.o
"_sqlite3_bind_parameter_name", referenced from:
__cffi_d_sqlite3_bind_parameter_name in _sqlite3_cffi.o
"_sqlite3_bind_text", referenced from:
__cffi_d_sqlite3_bind_text in _sqlite3_cffi.o
"_sqlite3_bind_text16", referenced from:
__cffi_d_sqlite3_bind_text16 in _sqlite3_cffi.o
"_sqlite3_bind_value", referenced from:
__cffi_d_sqlite3_bind_value in _sqlite3_cffi.o
"_sqlite3_bind_zeroblob", referenced from:
__cffi_d_sqlite3_bind_zeroblob in _sqlite3_cffi.o
"_sqlite3_blob_bytes", referenced from:
__cffi_d_sqlite3_blob_bytes in _sqlite3_cffi.o
"_sqlite3_blob_close", referenced from:
__cffi_d_sqlite3_blob_close in _sqlite3_cffi.o
"_sqlite3_blob_open", referenced from:
__cffi_d_sqlite3_blob_open in _sqlite3_cffi.o
"_sqlite3_blob_read", referenced from:
__cffi_d_sqlite3_blob_read in _sqlite3_cffi.o
"_sqlite3_blob_write", referenced from:
__cffi_d_sqlite3_blob_write in _sqlite3_cffi.o
"_sqlite3_busy_timeout", referenced from:
__cffi_d_sqlite3_busy_timeout in _sqlite3_cffi.o
"_sqlite3_changes", referenced from:
__cffi_d_sqlite3_changes in _sqlite3_cffi.o
"_sqlite3_close", referenced from:
__cffi_d_sqlite3_close in _sqlite3_cffi.o
"_sqlite3_column_blob", referenced from:
__cffi_d_sqlite3_column_blob in _sqlite3_cffi.o
"_sqlite3_column_bytes", referenced from:
__cffi_d_sqlite3_column_bytes in _sqlite3_cffi.o
"_sqlite3_column_count", referenced from:
__cffi_d_sqlite3_column_count in _sqlite3_cffi.o
"_sqlite3_column_decltype", referenced from:
__cffi_d_sqlite3_column_decltype in _sqlite3_cffi.o
"_sqlite3_column_double", referenced from:
__cffi_d_sqlite3_column_double in _sqlite3_cffi.o
"_sqlite3_column_int", referenced from:
__cffi_d_sqlite3_column_int in _sqlite3_cffi.o
"_sqlite3_column_int64", referenced from:
__cffi_d_sqlite3_column_int64 in _sqlite3_cffi.o
"_sqlite3_column_name", referenced from:
__cffi_d_sqlite3_column_name in _sqlite3_cffi.o
"_sqlite3_column_text", referenced from:
__cffi_d_sqlite3_column_text in _sqlite3_cffi.o
"_sqlite3_column_text16", referenced from:
__cffi_d_sqlite3_column_text16 in _sqlite3_cffi.o
"_sqlite3_column_type", referenced from:
__cffi_d_sqlite3_column_type in _sqlite3_cffi.o
"_sqlite3_complete", referenced from:
__cffi_d_sqlite3_complete in _sqlite3_cffi.o
"_sqlite3_create_collation", referenced from:
__cffi_d_sqlite3_create_collation in _sqlite3_cffi.o
"_sqlite3_create_function", referenced from:
__cffi_d_sqlite3_create_function in _sqlite3_cffi.o
"_sqlite3_create_window_function", referenced from:
__cffi_d_sqlite3_create_window_function in _sqlite3_cffi.o
"_sqlite3_data_count", referenced from:
__cffi_d_sqlite3_data_count in _sqlite3_cffi.o
"_sqlite3_db_config", referenced from:
__cffi_const_sqlite3_db_config in _sqlite3_cffi.o
"_sqlite3_deserialize", referenced from:
__cffi_d_sqlite3_deserialize in _sqlite3_cffi.o
"_sqlite3_errcode", referenced from:
__cffi_d_sqlite3_errcode in _sqlite3_cffi.o
"_sqlite3_errmsg", referenced from:
__cffi_d_sqlite3_errmsg in _sqlite3_cffi.o
"_sqlite3_errstr", referenced from:
__cffi_d_sqlite3_errstr in _sqlite3_cffi.o
"_sqlite3_expanded_sql", referenced from:
__cffi_d_sqlite3_expanded_sql in _sqlite3_cffi.o
"_sqlite3_extended_errcode", referenced from:
__cffi_d_sqlite3_extended_errcode in _sqlite3_cffi.o
"_sqlite3_finalize", referenced from:
__cffi_d_sqlite3_finalize in _sqlite3_cffi.o
"_sqlite3_free", referenced from:
__cffi_d_sqlite3_free in _sqlite3_cffi.o
"_sqlite3_get_autocommit", referenced from:
__cffi_d_sqlite3_get_autocommit in _sqlite3_cffi.o
"_sqlite3_interrupt", referenced from:
__cffi_d_sqlite3_interrupt in _sqlite3_cffi.o
"_sqlite3_last_insert_rowid", referenced from:
__cffi_d_sqlite3_last_insert_rowid in _sqlite3_cffi.o
"_sqlite3_libversion", referenced from:
__cffi_d_sqlite3_libversion in _sqlite3_cffi.o
"_sqlite3_libversion_number", referenced from:
__cffi_d_sqlite3_libversion_number in _sqlite3_cffi.o
"_sqlite3_limit", referenced from:
__cffi_d_sqlite3_limit in _sqlite3_cffi.o
"_sqlite3_malloc", referenced from:
__cffi_d_sqlite3_malloc in _sqlite3_cffi.o
"_sqlite3_malloc64", referenced from:
__cffi_d_sqlite3_malloc64 in _sqlite3_cffi.o
"_sqlite3_open", referenced from:
__cffi_d_sqlite3_open in _sqlite3_cffi.o
"_sqlite3_open_v2", referenced from:
__cffi_d_sqlite3_* _ctypes/_ctypes_build.py
* _pypy_util_build.py
* _blake2/_blake2_build.py
* _sha3/_sha3_build.py
* _ssl_build.py
* adding Homebrew openssl@3 flags for _ssl: -I/opt/homebrew_x86_64/opt/openssl@3/include -L/opt/homebrew_x86_64/opt/openssl@3/lib
* _sqlite3_build.py
* adding Homebrew sqlite flags for sqlite3: -I/opt/homebrew_x86_64/opt/sqlite/include -L/opt/homebrew_x86_64/opt/sqlite/lib
Traceback (most recent call last):
File "/Users/matti/build-worker-x86_64/pypy-c-jit-macos-x86-64/build/lib_pypy/pypy_tools/build_cffi_imports.py", line 361, in create_cffi_import_libraries
raise RuntimeError('building {} failed'.format(key))
RuntimeError: building sqlite3 failed
* _audioop_build.py
* _tkinter/tklib_build.py
* adding Homebrew tcl-tk flags for _tkinter: -I/opt/homebrew_x86_64/opt/tcl-tk/include -L/opt/homebrew_x86_64/opt/tcl-tk/lib
Traceback (most recent call last):
File "/Users/matti/build-worker-x86_64/pypy-c-jit-macos-x86-64/build/lib_pypy/pypy_tools/build_cffi_imports.py", line 361, in create_cffi_import_libraries
raise RuntimeError('building {} failed'.format(key))
RuntimeError: building _tkinter failed
* _curses_build.py
* _syslog_build.py
* _gdbm_build.py
* adding Homebrew gdbm flags for _gdbm: -I/opt/homebrew_x86_64/opt/gdbm/include -L/opt/homebrew_x86_64/opt/gdbm/lib
Traceback (most recent call last):
File "/Users/matti/build-worker-x86_64/pypy-c-jit-macos-x86-64/build/lib_pypy/pypy_tools/build_cffi_imports.py", line 361, in create_cffi_import_libraries
raise RuntimeError('building {} failed'.format(key))
RuntimeError: building _gdbm failed
* _pwdgrp_build.py
* _resource_build.py
* _lzma_build.py
* adding Homebrew xz flags for lzma: -I/opt/homebrew_x86_64/opt/xz/include -L/opt/homebrew_x86_64/opt/xz/lib
Traceback (most recent call last):
File "/Users/matti/build-worker-x86_64/pypy-c-jit-macos-x86-64/build/lib_pypy/pypy_tools/build_cffi_imports.py", line 361, in create_cffi_import_libraries
raise RuntimeError('building {} failed'.format(key))
RuntimeError: building lzma failed
* _posixshmem_build.py
*** failed to build the CFFI modules ['_sqlite3_build.py', '_tkinter/tklib_build.py', '_gdbm_build.py', '_lzma_build.py']
PyPy can still be used as long as you don't need the corresponding
modules. If you do need them, please install the missing headers and
libraries (see error messages just above) and then re-run the command:
/Users/matti/build-worker-x86_64/pypy-c-jit-macos-x86-64/build/pypy/goal/pypy3.12-c /Users/matti/build-worker-x86_64/pypy-c-jit-macos-x86-64/build/pypy/../lib_pypy/pypy_tools/build_cffi_imports.py
open_v2 in _sqlite3_cffi.o
"_sqlite3_prepare", referenced from:
__cffi_d_sqlite3_prepare in _sqlite3_cffi.o
"_sqlite3_prepare_v2", referenced from:
__cffi_d_sqlite3_prepare_v2 in _sqlite3_cffi.o
"_sqlite3_progress_handler", referenced from:
__cffi_d_sqlite3_progress_handler in _sqlite3_cffi.o
"_sqlite3_reset", referenced from:
__cffi_d_sqlite3_reset in _sqlite3_cffi.o
"_sqlite3_result_blob", referenced from:
__cffi_d_sqlite3_result_blob in _sqlite3_cffi.o
"_sqlite3_result_double", referenced from:
__cffi_d_sqlite3_result_double in _sqlite3_cffi.o
"_sqlite3_result_error", referenced from:
__cffi_d_sqlite3_result_error in _sqlite3_cffi.o
"_sqlite3_result_error16", referenced from:
__cffi_d_sqlite3_result_error16 in _sqlite3_cffi.o
"_sqlite3_result_error_code", referenced from:
__cffi_d_sqlite3_result_error_code in _sqlite3_cffi.o
"_sqlite3_result_error_nomem", referenced from:
__cffi_d_sqlite3_result_error_nomem in _sqlite3_cffi.o
"_sqlite3_result_error_toobig", referenced from:
__cffi_d_sqlite3_result_error_toobig in _sqlite3_cffi.o
"_sqlite3_result_int", referenced from:
__cffi_d_sqlite3_result_int in _sqlite3_cffi.o
"_sqlite3_result_int64", referenced from:
__cffi_d_sqlite3_result_int64 in _sqlite3_cffi.o
"_sqlite3_result_null", referenced from:
__cffi_d_sqlite3_result_null in _sqlite3_cffi.o
"_sqlite3_result_text", referenced from:
__cffi_d_sqlite3_result_text in _sqlite3_cffi.o
"_sqlite3_result_text16", referenced from:
__cffi_d_sqlite3_result_text16 in _sqlite3_cffi.o
"_sqlite3_result_text16be", referenced from:
__cffi_d_sqlite3_result_text16be in _sqlite3_cffi.o
"_sqlite3_result_text16le", referenced from:
__cffi_d_sqlite3_result_text16le in _sqlite3_cffi.o
"_sqlite3_result_value", referenced from:
__cffi_d_sqlite3_result_value in _sqlite3_cffi.o
"_sqlite3_result_zeroblob", referenced from:
__cffi_d_sqlite3_result_zeroblob in _sqlite3_cffi.o
"_sqlite3_serialize", referenced from:
__cffi_d_sqlite3_serialize in _sqlite3_cffi.o
"_sqlite3_set_authorizer", referenced from:
__cffi_d_sqlite3_set_authorizer in _sqlite3_cffi.o
"_sqlite3_sleep", referenced from:
__cffi_d_sqlite3_sleep in _sqlite3_cffi.o
"_sqlite3_step", referenced from:
__cffi_d_sqlite3_step in _sqlite3_cffi.o
"_sqlite3_threadsafe", referenced from:
__cffi_d_sqlite3_threadsafe in _sqlite3_cffi.o
"_sqlite3_total_changes", referenced from:
__cffi_d_sqlite3_total_changes in _sqlite3_cffi.o
"_sqlite3_trace_v2", referenced from:
__cffi_d_sqlite3_trace_v2 in _sqlite3_cffi.o
"_sqlite3_value_blob", referenced from:
__cffi_d_sqlite3_value_blob in _sqlite3_cffi.o
"_sqlite3_value_bytes", referenced from:
__cffi_d_sqlite3_value_bytes in _sqlite3_cffi.o
"_sqlite3_value_bytes16", referenced from:
__cffi_d_sqlite3_value_bytes16 in _sqlite3_cffi.o
"_sqlite3_value_double", referenced from:
__cffi_d_sqlite3_value_double in _sqlite3_cffi.o
"_sqlite3_value_int", referenced from:
__cffi_d_sqlite3_value_int in _sqlite3_cffi.o
"_sqlite3_value_int64", referenced from:
__cffi_d_sqlite3_value_int64 in _sqlite3_cffi.o
"_sqlite3_value_numeric_type", referenced from:
__cffi_d_sqlite3_value_numeric_type in _sqlite3_cffi.o
"_sqlite3_value_text", referenced from:
__cffi_d_sqlite3_value_text in _sqlite3_cffi.o
"_sqlite3_value_text16", referenced from:
__cffi_d_sqlite3_value_text16 in _sqlite3_cffi.o
"_sqlite3_value_text16be", referenced from:
__cffi_d_sqlite3_value_text16be in _sqlite3_cffi.o
"_sqlite3_value_text16le", referenced from:
__cffi_d_sqlite3_value_text16le in _sqlite3_cffi.o
"_sqlite3_value_type", referenced from:
__cffi_d_sqlite3_value_type in _sqlite3_cffi.o
ld: symbol(s) not found for architecture x86_64
clang: error: linker command failed with exit code 1 (use -v to see invocation)
command failed (status 1): clang -shared -Wl,-headerpad_max_install_names -L/opt/homebrew_x86_64/opt/sqlite/lib _sqlite3_cffi.o -lsqlite3 -o _sqlite3_cffi.pypy312-pp80-darwin.so
stdout:
stderr:
Traceback (most recent call last):
File "/Users/matti/build-worker-x86_64/pypy-c-jit-macos-x86-64/build/lib_pypy/_tkinter/tklib_build.py", line 63, in <module>
config_lib = config_ffi.verify("""
^^^^^^
File "/Users/matti/build-worker-x86_64/pypy-c-jit-macos-x86-64/build/lib_pypy/cffi/api.py", line 461, in verify
lib = self.verifier.load_library()
^^^^^^^^^^^^
File "/Users/matti/build-worker-x86_64/pypy-c-jit-macos-x86-64/build/lib_pypy/cffi/verifier.py", line 105, in load_library
self._compile_module()
^^^^^^^^^^^^^^^
File "/Users/matti/build-worker-x86_64/pypy-c-jit-macos-x86-64/build/lib_pypy/cffi/verifier.py", line 201, in _compile_module
outputfilename = ffiplatform.compile(tmpdir, self.get_extension())
^^^^^^^
File "/Users/matti/build-worker-x86_64/pypy-c-jit-macos-x86-64/build/lib_pypy/cffi/ffiplatform.py", line 48, in compile
outputfilename = backend.build(ext, tmpdir, compiler_verbose, debug)
^^^^^
File "/Users/matti/build-worker-x86_64/pypy-c-jit-macos-x86-64/build/lib_pypy/pypy_tools/_cffi_compile.py", line 227, in build
return _build_unix(ext, compiler_verbose)
^^^^^^^^^^^^^^^^^^^^^^^^^^^^^^^^^^
File "/Users/matti/build-worker-x86_64/pypy-c-jit-macos-x86-64/build/lib_pypy/pypy_tools/_cffi_compile.py", line 158, in _build_unix
_run(args, verbose)
File "/Users/matti/build-worker-x86_64/pypy-c-jit-macos-x86-64/build/lib_pypy/pypy_tools/_cffi_compile.py", line 111, in _run
raise VerificationError(
cffi.VerificationError: clang: error: no such file or directory: '_tkinter/__pycache__/_cffi__gfdaa97a4x4933628c.c'
clang: error: no input files
command failed (status 1): clang -fPIC -I/Users/matti/build-worker-x86_64/pypy-c-jit-macos-x86-64/build/include/pypy3.12 -I/opt/homebrew_x86_64/opt/tcl-tk/include -fPIC -I/Users/matti/build-worker-x86_64/pypy-c-jit-macos-x86-64/build/include/pypy3.12 -I/usr/local/opt/tcl-tk/include -I/opt/homebrew_x86_64/opt/tcl-tk@8/include/tcl-tk -c _tkinter/__pycache__/_cffi__gfdaa97a4x4933628c.c -o _cffi__gfdaa97a4x4933628c.o
stdout:
stderr:
/Users/matti/build-worker-x86_64/pypy-c-jit-macos-x86-64/build/lib_pypy/cffi/cparser.py:163: UserWarning: Global variable 'gdbm_errno' in cdef(): for consistency with C it should have a storage class specifier (usually 'extern')
warnings.warn("Global variable '%s' in cdef(): for consistency "
Traceback (most recent call last):
File "/Users/matti/build-worker-x86_64/pypy-c-jit-macos-x86-64/build/lib_pypy/_gdbm_build.py", line 77, in <module>
ffi.compile()
^^^^^^^
File "/Users/matti/build-worker-x86_64/pypy-c-jit-macos-x86-64/build/lib_pypy/cffi/api.py", line 720, in compile
return recompile(self, module_name, source, tmpdir=tmpdir,
^^^^^^^^^^^^^^^^^^^^^^^^^^^^^^^^^^^^^^^^^^^^^^^^^^^
File "/Users/matti/build-worker-x86_64/pypy-c-jit-macos-x86-64/build/lib_pypy/cffi/recompiler.py", line 1569, in recompile
outputfilename = ffiplatform.compile('.', ext,
^^^^^^^
File "/Users/matti/build-worker-x86_64/pypy-c-jit-macos-x86-64/build/lib_pypy/cffi/ffiplatform.py", line 48, in compile
outputfilename = backend.build(ext, tmpdir, compiler_verbose, debug)
^^^^^
File "/Users/matti/build-worker-x86_64/pypy-c-jit-macos-x86-64/build/lib_pypy/pypy_tools/_cffi_compile.py", line 227, in build
return _build_unix(ext, compiler_verbose)
^^^^^^^^^^^^^^^^^^^^^^^^^^^^^^^^^^
File "/Users/matti/build-worker-x86_64/pypy-c-jit-macos-x86-64/build/lib_pypy/pypy_tools/_cffi_compile.py", line 168, in _build_unix
_run(args, verbose)
File "/Users/matti/build-worker-x86_64/pypy-c-jit-macos-x86-64/build/lib_pypy/pypy_tools/_cffi_compile.py", line 111, in _run
raise VerificationError(
cffi.VerificationError: ld: warning: ignoring file '/opt/homebrew_x86_64/Cellar/gdbm/1.26/lib/libgdbm.6.dylib': found architecture 'arm64', required architecture 'x86_64'
Undefined symbols for architecture x86_64:
"_gdbm_close", referenced from:
_pygdbm_close in _gdbm_cffi.o
"_gdbm_delete", referenced from:
__cffi_f_gdbm_delete in _gdbm_cffi.o
__cffi_d_gdbm_delete in _gdbm_cffi.o
"_gdbm_errno_location", referenced from:
__cffi_var_gdbm_errno in _gdbm_cffi.o
"_gdbm_exists", referenced from:
__cffi_f_gdbm_exists in _gdbm_cffi.o
__cffi_d_gdbm_exists in _gdbm_cffi.o
_pygdbm_exists in _gdbm_cffi.o
"_gdbm_fetch", referenced from:
__cffi_f_gdbm_fetch in _gdbm_cffi.o
__cffi_d_gdbm_fetch in _gdbm_cffi.o
_pygdbm_fetch in _gdbm_cffi.o
"_gdbm_firstkey", referenced from:
__cffi_f_gdbm_firstkey in _gdbm_cffi.o
__cffi_d_gdbm_firstkey in _gdbm_cffi.o
"_gdbm_nextkey", referenced from:
__cffi_f_gdbm_nextkey in _gdbm_cffi.o
__cffi_d_gdbm_nextkey in _gdbm_cffi.o
"_gdbm_open", referenced from:
__cffi_d_gdbm_open in _gdbm_cffi.o
"_gdbm_reorganize", referenced from:
__cffi_d_gdbm_reorganize in _gdbm_cffi.o
"_gdbm_store", referenced from:
__cffi_f_gdbm_store in _gdbm_cffi.o
__cffi_d_gdbm_store in _gdbm_cffi.o
"_gdbm_strerror", referenced from:
__cffi_d_gdbm_strerror in _gdbm_cffi.o
"_gdbm_sync", referenced from:
__cffi_d_gdbm_sync in _gdbm_cffi.o
ld: symbol(s) not found for architecture x86_64
clang: error: linker command failed with exit code 1 (use -v to see invocation)
command failed (status 1): clang -shared -Wl,-headerpad_max_install_names -L/opt/homebrew_x86_64/opt/gdbm/lib _gdbm_cffi.o -lgdbm -o _gdbm_cffi.pypy312-pp80-darwin.so
stdout:
stderr:
Traceback (most recent call last):
File "/Users/matti/build-worker-x86_64/pypy-c-jit-macos-x86-64/build/lib_pypy/_lzma_build.py", line 291, in <module>
ffi.compile()
^^^^^^^
File "/Users/matti/build-worker-x86_64/pypy-c-jit-macos-x86-64/build/lib_pypy/cffi/api.py", line 720, in compile
return recompile(self, module_name, source, tmpdir=tmpdir,
^^^^^^^^^^^^^^^^^^^^^^^^^^^^^^^^^^^^^^^^^^^^^^^^^^^
File "/Users/matti/build-worker-x86_64/pypy-c-jit-macos-x86-64/build/lib_pypy/cffi/recompiler.py", line 1569, in recompile
outputfilename = ffiplatform.compile('.', ext,
^^^^^^^
File "/Users/matti/build-worker-x86_64/pypy-c-jit-macos-x86-64/build/lib_pypy/cffi/ffiplatform.py", line 48, in compile
outputfilename = backend.build(ext, tmpdir, compiler_verbose, debug)
^^^^^
File "/Users/matti/build-worker-x86_64/pypy-c-jit-macos-x86-64/build/lib_pypy/pypy_tools/_cffi_compile.py", line 227, in build
return _build_unix(ext, compiler_verbose)
^^^^^^^^^^^^^^^^^^^^^^^^^^^^^^^^^^
File "/Users/matti/build-worker-x86_64/pypy-c-jit-macos-x86-64/build/lib_pypy/pypy_tools/_cffi_compile.py", line 168, in _build_unix
_run(args, verbose)
File "/Users/matti/build-worker-x86_64/pypy-c-jit-macos-x86-64/build/lib_pypy/pypy_tools/_cffi_compile.py", line 111, in _run
raise VerificationError(
cffi.VerificationError: ld: warning: ignoring file '/opt/homebrew_x86_64/Cellar/xz/5.8.2/lib/liblzma.5.dylib': found architecture 'arm64', required architecture 'x86_64'
Undefined symbols for architecture x86_64:
"_lzma_alone_decoder", referenced from:
__cffi_d_lzma_alone_decoder in _lzma_cffi.o
"_lzma_alone_encoder", referenced from:
__cffi_d_lzma_alone_encoder in _lzma_cffi.o
"_lzma_auto_decoder", referenced from:
__cffi_d_lzma_auto_decoder in _lzma_cffi.o
"_lzma_block_compressed_size", referenced from:
__cffi_d_lzma_block_compressed_size in _lzma_cffi.o
"_lzma_block_decoder", referenced from:
__cffi_d_lzma_block_decoder in _lzma_cffi.o
"_lzma_block_header_decode", referenced from:
__cffi_d_lzma_block_header_decode in _lzma_cffi.o
"_lzma_check_is_supported", referenced from:
__cffi_d_lzma_check_is_supported in _lzma_cffi.o
"_lzma_code", referenced from:
__cffi_d_lzma_code in _lzma_cffi.o
"_lzma_easy_encoder", referenced from:
__cffi_d_lzma_easy_encoder in _lzma_cffi.o
"_lzma_end", referenced from:
__cffi_d_lzma_end in _lzma_cffi.o
"_lzma_get_check", referenced from:
__cffi_d_lzma_get_check in _lzma_cffi.o
"_lzma_index_block_count", referenced from:
__cffi_d_lzma_index_block_count in _lzma_cffi.o
"_lzma_index_buffer_decode", referenced from:
__cffi_d_lzma_index_buffer_decode in _lzma_cffi.o
"_lzma_index_cat", referenced from:
__cffi_d_lzma_index_cat in _lzma_cffi.o
"_lzma_index_dup", referenced from:
__cffi_d_lzma_index_dup in _lzma_cffi.o
"_lzma_index_end", referenced from:
__cffi_d_lzma_index_end in _lzma_cffi.o
"_lzma_index_init", referenced from:
__cffi_d_lzma_index_init in _lzma_cffi.o
"_lzma_index_iter_init", referenced from:
__cffi_d_lzma_index_iter_init in _lzma_cffi.o
"_lzma_index_iter_locate", referenced from:
__cffi_d_lzma_index_iter_locate in _lzma_cffi.o
"_lzma_index_iter_next", referenced from:
__cffi_d_lzma_index_iter_next in _lzma_cffi.o
"_lzma_index_size", referenced from:
__cffi_d_lzma_index_size in _lzma_cffi.o
"_lzma_index_stream_padding", referenced from:
__cffi_d_lzma_index_stream_padding in _lzma_cffi.o
"_lzma_index_stream_size", referenced from:
__cffi_d_lzma_index_stream_size in _lzma_cffi.o
"_lzma_index_total_size", referenced from:
__cffi_d_lzma_index_total_size in _lzma_cffi.o
"_lzma_index_uncompressed_size", referenced from:
__cffi_d_lzma_index_uncompressed_size in _lzma_cffi.o
"_lzma_lzma_preset", referenced from:
__cffi_d_lzma_lzma_preset in _lzma_cffi.o
"_lzma_properties_decode", referenced from:
__cffi_d_lzma_properties_decode in _lzma_cffi.o
"_lzma_properties_encode", referenced from:
__cffi_d_lzma_properties_encode in _lzma_cffi.o
"_lzma_properties_size", referenced from:
__cffi_d_lzma_properties_size in _lzma_cffi.o
"_lzma_raw_decoder", referenced from:
__cffi_d_lzma_raw_decoder in _lzma_cffi.o
"_lzma_raw_encoder", referenced from:
__cffi_d_lzma_raw_encoder in _lzma_cffi.o
"_lzma_stream_decoder", referenced from:
__cffi_d_lzma_stream_decoder in _lzma_cffi.o
"_lzma_stream_encoder", referenced from:
__cffi_d_lzma_stream_encoder in _lzma_cffi.o
"_lzma_stream_flags_compare", referenced from:
__cffi_d_lzma_stream_flags_compare in _lzma_cffi.o
"_lzma_stream_footer_decode", referenced from:
__cffi_d_lzma_stream_footer_decode in _lzma_cffi.o
"_lzma_stream_header_decode", referenced from:
__cffi_d_lzma_stream_header_decode in _lzma_cffi.o
ld: symbol(s) not found for architecture x86_64
clang: error: linker command failed with exit code 1 (use -v to see invocation)
command failed (status 1): clang -shared -Wl,-headerpad_max_install_names -L/opt/homebrew_x86_64/opt/xz/lib _lzma_cffi.o -llzma -o _lzma_cffi.pypy312-pp80-darwin.so
[translation:info] usession directory: /tmp/buildbot-x86_64/usession-py3.12-740
[Timer] Timings:
[Timer] loading target --- 57.7 s
[Timer] annotate --- 215.5 s
[Timer] rtype_lltype --- 94.6 s
[Timer] pyjitpl_lltype --- 208.3 s
[Timer] backendopt_lltype --- 90.7 s
[Timer] stackcheckinsertion_lltype --- 4.3 s
[Timer] database_c --- 161.2 s
[Timer] source_c --- 82.1 s
[Timer] compile_c --- 174.2 s
[Timer] build_cffi_imports --- 27.1 s
[Timer] ===========================================
[Timer] Total: --- 1115.7 s
program finished with exit code 0
elapsedTime=1147.544565