python testrunner/lib_python_tests.py
in dir /buildbot/slave/pypy-c-jit-linux-x86-32/build (timeout 4000 secs)
watching logfiles {'pytestLog': 'cpython.log'}
argv: ['python', 'testrunner/lib_python_tests.py']
environment:
AUDITWHEEL_ARCH=i686
AUDITWHEEL_PLAT=manylinux_2_28_i686
AUDITWHEEL_POLICY=manylinux_2_28
DEVTOOLSET_ROOTPATH=/opt/rh/gcc-toolset-14/root
HGDEMANDIMPORT=disable
HOME=/home/buildworker
HOSTNAME=Debian-trixie-latest-amd64-base
LANG=en_US.UTF-8
LANGUAGE=en_US.UTF-8
LC_ALL=en_US.UTF-8
LD_LIBRARY_PATH=/usr/local/lib:/opt/rh/gcc-toolset-14/root/usr/lib64:/opt/rh/gcc-toolset-14/root/usr/lib:/opt/rh/gcc-toolset-14/root/usr/lib64/dyninst:/opt/rh/gcc-toolset-14/root/usr/lib/dyninst
OLDPWD=/buildbot/slave
PATH=/tmp/venv/bin:/opt/clang/bin:/opt/rh/gcc-toolset-14/root/usr/bin:/usr/local/sbin:/usr/local/bin:/usr/sbin:/usr/bin:/sbin:/bin:/opt/pypy2.7-v7.3.23-linux32/bin
PKG_CONFIG_PATH=/usr/local/lib/pkgconfig
PS1=(venv)
PWD=/buildbot/slave/pypy-c-jit-linux-x86-32/build
PYPY_LOCALBASE=/usr/local
PYPY_MAKE_PORTABLE=1
SETUPTOOLS_USE_DISTUTILS=stdlib
SHLVL=1
SSL_CERT_FILE=/opt/_internal/certs.pem
TERM=xterm
TMPDIR=/tmp/pytest
VIRTUAL_ENV=/tmp/venv
container=podman
using PTY: False
/tmp/venv/site-packages/hypothesis/extra/pytestplugin.py:61: HypothesisWarning:
You are using Pytest version 2.9.2. Hypothesis tests work with any test
runner, but our Pytest plugin requires Pytest 4.3 or newer.
Note that the Pytest developers no longer support this version either!
Disabling the Hypothesis pytest plugin...
warnings.warn(PYTEST_TOO_OLD_MESSAGE % (pytest.__version__,), HypothesisWarning)
============================= test session starts ==============================
platform linux2 -- Python 2.7.18[pypy-7.3.23-final], pytest-2.9.2, py-1.4.29, pluggy-0.3.1
rootdir: /buildbot/slave/pypy-c-jit-linux-x86-32/build, inifile: pytest.ini
plugins: hypothesis-4.57.1
collected 406 items
lib-python/2.7/test/test_MimeWriter.py .
lib-python/2.7/test/test_SimpleHTTPServer.py .
lib-python/2.7/test/test_StringIO.py .
lib-python/2.7/test/test___all__.py .
lib-python/2.7/test/test___future__.py .
lib-python/2.7/test/test__locale.py .
lib-python/2.7/test/test__osx_support.py .
lib-python/2.7/test/test_abc.py .
lib-python/2.7/test/test_abstract_numbers.py .
lib-python/2.7/test/test_aepack.py s
lib-python/2.7/test/test_aifc.py .
lib-python/2.7/test/test_al.py s
lib-python/2.7/test/test_anydbm.py .
lib-python/2.7/test/test_applesingle.py s
lib-python/2.7/test/test_argparse.py .
lib-python/2.7/test/test_array.py .
lib-python/2.7/test/test_ascii_formatd.py s
lib-python/2.7/test/test_ast.py .
lib-python/2.7/test/test_asynchat.py .
lib-python/2.7/test/test_asyncore.py .
lib-python/2.7/test/test_atexit.py .
lib-python/2.7/test/test_audioop.py .
lib-python/2.7/test/test_augassign.py .
lib-python/2.7/test/test_base64.py .
lib-python/2.7/test/test_bastion.py .
lib-python/2.7/test/test_bdb.py s
lib-python/2.7/test/test_bigaddrspace.py .
lib-python/2.7/test/test_bigmem.py .
lib-python/2.7/test/test_binascii.py .
lib-python/2.7/test/test_binhex.py .
lib-python/2.7/test/test_binop.py .
lib-python/2.7/test/test_bisect.py s
lib-python/2.7/test/test_bool.py .
lib-python/2.7/test/test_bsddb.py s
lib-python/2.7/test/test_bsddb185.py s
lib-python/2.7/test/test_bsddb3.py s
lib-python/2.7/test/test_buffer.py .
lib-python/2.7/test/test_bufio.py .
lib-python/2.7/test/test_builtin.py .
lib-python/2.7/test/test_bytes.py .
lib-python/2.7/test/test_bz2.py .
lib-python/2.7/test/test_calendar.py .
lib-python/2.7/test/test_call.py .
lib-python/2.7/test/test_capi.py .
lib-python/2.7/test/test_cd.py s
lib-python/2.7/test/test_cfgparser.py .
lib-python/2.7/test/test_cgi.py .
lib-python/2.7/test/test_charmapcodec.py .
lib-python/2.7/test/test_cl.py s
lib-python/2.7/test/test_class.py .
lib-python/2.7/test/test_cmath.py .
lib-python/2.7/test/test_cmd.py .
lib-python/2.7/test/test_cmd_line.py .
lib-python/2.7/test/test_cmd_line_script.py .
lib-python/2.7/test/test_code.py .
lib-python/2.7/test/test_codeccallbacks.py .
lib-python/2.7/test/test_codecencodings_cn.py .
lib-python/2.7/test/test_codecencodings_hk.py .
lib-python/2.7/test/test_codecencodings_iso2022.py .
lib-python/2.7/test/test_codecencodings_jp.py .
lib-python/2.7/test/test_codecencodings_kr.py .
lib-python/2.7/test/test_codecencodings_tw.py .
lib-python/2.7/test/test_codecmaps_cn.py .
lib-python/2.7/test/test_codecmaps_hk.py .
lib-python/2.7/test/test_codecmaps_jp.py .
lib-python/2.7/test/test_codecmaps_kr.py .
lib-python/2.7/test/test_codecmaps_tw.py .
lib-python/2.7/test/test_codecs.py .
lib-python/2.7/test/test_codeop.py .
lib-python/2.7/test/test_coercion.py .
lib-python/2.7/test/test_collections.py .
lib-python/2.7/test/test_colorsys.py .
lib-python/2.7/test/test_commands.py .
lib-python/2.7/test/test_compare.py .
lib-python/2.7/test/test_compile.py .
lib-python/2.7/test/test_compileall.py .
lib-python/2.7/test/test_compiler.py s
lib-python/2.7/test/test_complex.py .
lib-python/2.7/test/test_complex_args.py .
lib-python/2.7/test/test_contains.py .
lib-python/2.7/test/test_contextlib.py .
lib-python/2.7/test/test_cookie.py .
lib-python/2.7/test/test_cookielib.py .
lib-python/2.7/test/test_copy.py .
lib-python/2.7/test/test_copy_reg.py .
lib-python/2.7/test/test_cpickle.py .
lib-python/2.7/test/test_cprofile.py .
lib-python/2.7/test/test_crypt.py .
lib-python/2.7/test/test_csv.py .
lib-python/2.7/test/test_ctypes.py .
lib-python/2.7/test/test_curses.py .
lib-python/2.7/test/test_datetime.py .
lib-python/2.7/test/test_dbm.py .
lib-python/2.7/test/test_decimal.py .
lib-python/2.7/test/test_decorators.py .
lib-python/2.7/test/test_defaultdict.py .
lib-python/2.7/test/test_deque.py .
lib-python/2.7/test/test_descr.py .
lib-python/2.7/test/test_descrtut.py .
lib-python/2.7/test/test_dict.py .
lib-python/2.7/test/test_dictcomps.py .
lib-python/2.7/test/test_dictviews.py .
lib-python/2.7/test/test_difflib.py .
lib-python/2.7/test/test_dircache.py .
lib-python/2.7/test/test_dis.py .
lib-python/2.7/test/test_distutils.py s
lib-python/2.7/test/test_dl.py s
lib-python/2.7/test/test_doctest.py .
lib-python/2.7/test/test_doctest2.py .
lib-python/2.7/test/test_docxmlrpc.py .
lib-python/2.7/test/test_dumbdbm.py .
lib-python/2.7/test/test_dummy_thread.py .
lib-python/2.7/test/test_dummy_threading.py .
lib-python/2.7/test/test_email.py .
lib-python/2.7/test/test_email_codecs.py .
lib-python/2.7/test/test_email_renamed.py .
lib-python/2.7/test/test_ensurepip.py .
lib-python/2.7/test/test_enumerate.py .
lib-python/2.7/test/test_eof.py .
lib-python/2.7/test/test_epoll.py .
lib-python/2.7/test/test_errno.py .
lib-python/2.7/test/test_exception_variations.py .
lib-python/2.7/test/test_exceptions.py .
lib-python/2.7/test/test_extcall.py .
lib-python/2.7/test/test_fcntl.py .
lib-python/2.7/test/test_file.py .
lib-python/2.7/test/test_file2k.py .
lib-python/2.7/test/test_file_eintr.py .
lib-python/2.7/test/test_filecmp.py .
lib-python/2.7/test/test_fileinput.py .
lib-python/2.7/test/test_fileio.py .
lib-python/2.7/test/test_float.py .
lib-python/2.7/test/test_fnmatch.py .
lib-python/2.7/test/test_fork1.py .
lib-python/2.7/test/test_format.py .
lib-python/2.7/test/test_fpformat.py .
lib-python/2.7/test/test_fractions.py .
lib-python/2.7/test/test_frozen.py s
lib-python/2.7/test/test_ftplib.py .
lib-python/2.7/test/test_funcattrs.py .
lib-python/2.7/test/test_functools.py .
lib-python/2.7/test/test_future.py .
lib-python/2.7/test/test_future1.py .
lib-python/2.7/test/test_future2.py .
lib-python/2.7/test/test_future3.py .
lib-python/2.7/test/test_future4.py .
lib-python/2.7/test/test_future5.py .
lib-python/2.7/test/test_future_builtins.py .
lib-python/2.7/test/test_gc.py s
lib-python/2.7/test/test_gdb.py s
lib-python/2.7/test/test_gdbm.py .
lib-python/2.7/test/test_generators.py .
lib-python/2.7/test/test_genericpath.py .
lib-python/2.7/test/test_genexps.py .
lib-python/2.7/test/test_getargs.py .
lib-python/2.7/test/test_getargs2.py s
lib-python/2.7/test/test_getopt.py .
lib-python/2.7/test/test_gettext.py .
lib-python/2.7/test/test_gl.py s
lib-python/2.7/test/test_glob.py .
lib-python/2.7/test/test_global.py .
lib-python/2.7/test/test_grammar.py .
lib-python/2.7/test/test_grp.py .
lib-python/2.7/test/test_gzip.py .
lib-python/2.7/test/test_hash.py .
lib-python/2.7/test/test_hashlib.py .
lib-python/2.7/test/test_heapq.py .
lib-python/2.7/test/test_hmac.py .
lib-python/2.7/test/test_hotshot.py s
lib-python/2.7/test/test_htmllib.py .
lib-python/2.7/test/test_htmlparser.py .
lib-python/2.7/test/test_httplib.py .
lib-python/2.7/test/test_httpservers.py .
lib-python/2.7/test/test_idle.py .
lib-python/2.7/test/test_imageop.py s
lib-python/2.7/test/test_imaplib.py .
lib-python/2.7/test/test_imgfile.py s
lib-python/2.7/test/test_imghdr.py .
lib-python/2.7/test/test_imp.py .
lib-python/2.7/test/test_import.py .
lib-python/2.7/test/test_import_magic.py .
lib-python/2.7/test/test_importhooks.py .
lib-python/2.7/test/test_importlib.py .
lib-python/2.7/test/test_index.py .
lib-python/2.7/test/test_inspect.py .
lib-python/2.7/test/test_int.py .
lib-python/2.7/test/test_int_literal.py .
lib-python/2.7/test/test_io.py .
lib-python/2.7/test/test_ioctl.py s
lib-python/2.7/test/test_isinstance.py .
lib-python/2.7/test/test_iter.py .
lib-python/2.7/test/test_iterlen.py .
lib-python/2.7/test/test_itertools.py .
lib-python/2.7/test/test_json.py .
lib-python/2.7/test/test_kqueue.py s
lib-python/2.7/test/test_largefile.py .
lib-python/2.7/test/test_lib2to3.py .
lib-python/2.7/test/test_linecache.py .
lib-python/2.7/test/test_linuxaudiodev.py s
lib-python/2.7/test/test_list.py .
lib-python/2.7/test/test_locale.py .
lib-python/2.7/test/test_logging.py .
lib-python/2.7/test/test_long.py .
lib-python/2.7/test/test_long_future.py .
lib-python/2.7/test/test_longexp.py .
lib-python/2.7/test/test_macos.py s
lib-python/2.7/test/test_macostools.py s
lib-python/2.7/test/test_macpath.py .
lib-python/2.7/test/test_macurl2path.py .
lib-python/2.7/test/test_mailbox.py .
lib-python/2.7/test/test_marshal.py .
lib-python/2.7/test/test_math.py .
lib-python/2.7/test/test_md5.py .
lib-python/2.7/test/test_memoryio.py .
lib-python/2.7/test/test_memoryview.py .
lib-python/2.7/test/test_mhlib.py .
lib-python/2.7/test/test_mimetools.py .
lib-python/2.7/test/test_mimetypes.py .
lib-python/2.7/test/test_minidom.py .
lib-python/2.7/test/test_mmap.py .
lib-python/2.7/test/test_module.py .
lib-python/2.7/test/test_modulefinder.py .
lib-python/2.7/test/test_msilib.py s
lib-python/2.7/test/test_multibytecodec.py .
lib-python/2.7/test/test_multifile.py .
lib-python/2.7/test/test_multiprocessing.py .
lib-python/2.7/test/test_mutants.py .
lib-python/2.7/test/test_mutex.py .
lib-python/2.7/test/test_netrc.py .
lib-python/2.7/test/test_new.py .
lib-python/2.7/test/test_nis.py s
lib-python/2.7/test/test_nntplib.py .
lib-python/2.7/test/test_normalization.py .
lib-python/2.7/test/test_ntpath.py .
lib-python/2.7/test/test_old_mailbox.py .
lib-python/2.7/test/test_opcodes.py .
lib-python/2.7/test/test_openpty.py .
lib-python/2.7/test/test_operator.py .
lib-python/2.7/test/test_optparse.py .
lib-python/2.7/test/test_ordered_dict.py .
lib-python/2.7/test/test_os.py .
lib-python/2.7/test/test_ossaudiodev.py s
lib-python/2.7/test/test_parser.py s
lib-python/2.7/test/test_pdb.py .
lib-python/2.7/test/test_peepholer.py .
lib-python/2.7/test/test_pep247.py .
lib-python/2.7/test/test_pep277.py .
lib-python/2.7/test/test_pep352.py .
lib-python/2.7/test/test_pickle.py .
lib-python/2.7/test/test_pickletools.py .
lib-python/2.7/test/test_pipes.py .
lib-python/2.7/test/test_pkg.py .
lib-python/2.7/test/test_pkgimport.py .
lib-python/2.7/test/test_pkgutil.py .
lib-python/2.7/test/test_platform.py .
lib-python/2.7/test/test_plistlib.py .
lib-python/2.7/test/test_poll.py .
lib-python/2.7/test/test_popen.py .
lib-python/2.7/test/test_popen2.py .
lib-python/2.7/test/test_poplib.py .
lib-python/2.7/test/test_posix.py .
lib-python/2.7/test/test_posixpath.py .
lib-python/2.7/test/test_pow.py .
lib-python/2.7/test/test_pprint.py .
lib-python/2.7/test/test_print.py .
lib-python/2.7/test/test_profile.py .
lib-python/2.7/test/test_property.py .
lib-python/2.7/test/test_pstats.py .
lib-python/2.7/test/test_pty.py .
lib-python/2.7/test/test_pwd.py .
lib-python/2.7/test/test_py3kwarn.py s
lib-python/2.7/test/test_py_compile.py .
lib-python/2.7/test/test_pyclbr.py .
lib-python/2.7/test/test_pydoc.py .
lib-python/2.7/test/test_pyexpat.py .
lib-python/2.7/test/test_queue.py .
lib-python/2.7/test/test_quopri.py .
lib-python/2.7/test/test_random.py .
lib-python/2.7/test/test_re.py .
lib-python/2.7/test/test_readline.py .
lib-python/2.7/test/test_regrtest.py .
lib-python/2.7/test/test_repr.py .
lib-python/2.7/test/test_resource.py .
lib-python/2.7/test/test_rfc822.py .
lib-python/2.7/test/test_richcmp.py .
lib-python/2.7/test/test_rlcompleter.py .
lib-python/2.7/test/test_robotparser.py .
lib-python/2.7/test/test_runpy.py .
lib-python/2.7/test/test_sax.py .
lib-python/2.7/test/test_scope.py .
lib-python/2.7/test/test_scriptpackages.py s
lib-python/2.7/test/test_select.py .
lib-python/2.7/test/test_set.py .
lib-python/2.7/test/test_setcomps.py .
lib-python/2.7/test/test_sets.py .
lib-python/2.7/test/test_sgmllib.py .
lib-python/2.7/test/test_sha.py .
lib-python/2.7/test/test_shelve.py .
lib-python/2.7/test/test_shlex.py .
lib-python/2.7/test/test_shutil.py .
lib-python/2.7/test/test_signal.py .
lib-python/2.7/test/test_site.py .
lib-python/2.7/test/test_slice.py .
lib-python/2.7/test/test_smtplib.py .
lib-python/2.7/test/test_smtpnet.py .
lib-python/2.7/test/test_socket.py .
lib-python/2.7/test/test_socketserver.py .
lib-python/2.7/test/test_softspace.py .
lib-python/2.7/test/test_sort.py .
lib-python/2.7/test/test_source_encoding.py .
lib-python/2.7/test/test_spwd.py s
lib-python/2.7/test/test_sqlite.py .
lib-python/2.7/test/test_ssl.py .
lib-python/2.7/test/test_startfile.py s
lib-python/2.7/test/test_stat.py .
lib-python/2.7/test/test_str.py .
lib-python/2.7/test/test_strftime.py .
lib-python/2.7/test/test_string.py .
lib-python/2.7/test/test_stringprep.py .
lib-python/2.7/test/test_strop.py s
lib-python/2.7/test/test_strptime.py .
lib-python/2.7/test/test_strtod.py .
lib-python/2.7/test/test_struct.py .
lib-python/2.7/test/test_structmembers.py s
lib-python/2.7/test/test_structseq.py .
lib-python/2.7/test/test_subprocess.py .
lib-python/2.7/test/test_sunau.py .
lib-python/2.7/test/test_sunaudiodev.py s
lib-python/2.7/test/test_sundry.py .
lib-python/2.7/test/test_symtable.py s
lib-python/2.7/test/test_syntax.py .
lib-python/2.7/test/test_sys.py .
lib-python/2.7/test/test_sys_setprofile.py .
lib-python/2.7/test/test_sys_settrace.py .
lib-python/2.7/test/test_sysconfig.py .
lib-python/2.7/test/test_tarfile.py .
lib-python/2.7/test/test_tcl.py .
lib-python/2.7/test/test_telnetlib.py .
lib-python/2.7/test/test_tempfile.py .
lib-python/2.7/test/test_test_support.py .
lib-python/2.7/test/test_textwrap.py .
lib-python/2.7/test/test_thread.py .
lib-python/2.7/test/test_threaded_import.py .
lib-python/2.7/test/test_threadedtempfile.py .
lib-python/2.7/test/test_threading.py .
lib-python/2.7/test/test_threading_local.py .
lib-python/2.7/test/test_threadsignals.py .
lib-python/2.7/test/test_time.py .
lib-python/2.7/test/test_timeit.py .
lib-python/2.7/test/test_timeout.py .
lib-python/2.7/test/test_tk.py s
lib-python/2.7/test/test_tokenize.py .
lib-python/2.7/test/test_tools.py s
lib-python/2.7/test/test_trace.py .
lib-python/2.7/test/test_traceback.py .
lib-python/2.7/test/test_transformer.py .
lib-python/2.7/test/test_ttk_guionly.py s
lib-python/2.7/test/test_ttk_textonly.py .
lib-python/2.7/test/test_tuple.py .
lib-python/2.7/test/test_turtle.py .
lib-python/2.7/test/test_typechecks.py .
lib-python/2.7/test/test_types.py .
lib-python/2.7/test/test_ucn.py .
lib-python/2.7/test/test_unary.py .
lib-python/2.7/test/test_undocumented_details.py .
lib-python/2.7/test/test_unicode.py .
lib-python/2.7/test/test_unicode_file.py .
lib-python/2.7/test/test_unicodedata.py .
lib-python/2.7/test/test_unittest.py .
lib-python/2.7/test/test_univnewlines.py .
lib-python/2.7/test/test_univnewlines2k.py .
lib-python/2.7/test/test_unpack.py .
lib-python/2.7/test/test_urllib.py .
lib-python/2.7/test/test_urllib2.py .
lib-python/2.7/test/test_urllib2_localnet.py .
lib-python/2.7/test/test_urllib2net.py .
lib-python/2.7/test/test_urllibnet.py .
lib-python/2.7/test/test_urlparse.py .
lib-python/2.7/test/test_userdict.py .
lib-python/2.7/test/test_userlist.py .
lib-python/2.7/test/test_userstring.py .
lib-python/2.7/test/test_uu.py .
lib-python/2.7/test/test_uuid.py .
lib-python/2.7/test/test_wait3.py .
lib-python/2.7/test/test_wait4.py .
lib-python/2.7/test/test_warnings.py .
lib-python/2.7/test/test_wave.py .
lib-python/2.7/test/test_weakref.py .
lib-python/2.7/test/test_weakset.py .
lib-python/2.7/test/test_whichdb.py .
lib-python/2.7/test/test_winreg.py s
lib-python/2.7/test/test_winsound.py s
lib-python/2.7/test/test_with.py .
lib-python/2.7/test/test_wsgiref.py .
lib-python/2.7/test/test_xdrlib.py .
lib-python/2.7/test/test_xml_etree.py F
lib-python/2.7/test/test_xml_etree_c.py F
lib-python/2.7/test/test_xmllib.py .
lib-python/2.7/test/test_xmlrpc.py .
lib-python/2.7/test/test_xpickle.py .
lib-python/2.7/test/test_xrange.py .
lib-python/2.7/test/test_zipfile.py .
lib-python/2.7/test/test_zipfile64.py .
lib-python/2.7/test/test_zipimport.py .
lib-python/2.7/test/test_zipimport_support.py .
lib-python/2.7/test/test_zlib.py .
=================================== FAILURES ===================================
_______________________________________ _______________________________________
test_sanity (test.test_xml_etree.ModuleTest) ... ok
test_delslice (test.test_xml_etree.ElementSlicingTest) ... ok
test_getslice_negative_steps (test.test_xml_etree.ElementSlicingTest) ... ok
test_getslice_range (test.test_xml_etree.ElementSlicingTest) ... ok
test_getslice_single_index (test.test_xml_etree.ElementSlicingTest) ... ok
test_getslice_steps (test.test_xml_etree.ElementSlicingTest) ... ok
test_setslice_negative_steps (test.test_xml_etree.ElementSlicingTest) ... ok
test_setslice_range (test.test_xml_etree.ElementSlicingTest) ... ok
test_setslice_single_index (test.test_xml_etree.ElementSlicingTest) ... ok
test_setslice_steps (test.test_xml_etree.ElementSlicingTest) ... ok
test_cyclic_gc (test.test_xml_etree.BasicElementTest) ... ok
test_get_keyword_args (test.test_xml_etree.BasicElementTest) ... ok
test_weakref (test.test_xml_etree.BasicElementTest) ... ok
test_ass_subscr (test.test_xml_etree.BadElementTest) ... ok
test_element_get_tail (test.test_xml_etree.BadElementTest) ... ok
test_element_get_text (test.test_xml_etree.BadElementTest) ... ok
test_element_iter (test.test_xml_etree.BadElementTest) ... ok
test_extend_mutable_list (test.test_xml_etree.BadElementTest) ... ok
test_extend_mutable_list2 (test.test_xml_etree.BadElementTest) ... ok
test_recursive_repr (test.test_xml_etree.BadElementTest) ... ok
test_remove_with_mutating (test.test_xml_etree.BadElementTest) ... ok
test_subscr (test.test_xml_etree.BadElementTest) ... ok
test_find_with_error (test.test_xml_etree.BadElementPathTest) ... ok
test_find_with_mutating (test.test_xml_etree.BadElementPathTest) ... ok
test_findall_with_error (test.test_xml_etree.BadElementPathTest) ... ok
test_findall_with_mutating (test.test_xml_etree.BadElementPathTest) ... ok
test_findtext_with_error (test.test_xml_etree.BadElementPathTest) ... ok
test_findtext_with_mutating (test.test_xml_etree.BadElementPathTest) ... ok
test_attlist_default (test.test_xml_etree.ElementTreeTest) ... ok
test_attrib (test.test_xml_etree.ElementTreeTest) ... ok
test_cdata (test.test_xml_etree.ElementTreeTest) ... ok
test_copy (test.test_xml_etree.ElementTreeTest) ... ok
test_custom_builder (test.test_xml_etree.ElementTreeTest) ... ok
test_doctype_public (test.test_xml_etree.ElementTreeTest) ... ok
test_encoding (test.test_xml_etree.ElementTreeTest) ... FAIL
test_entity (test.test_xml_etree.ElementTreeTest) ... ok
test_file_init (test.test_xml_etree.ElementTreeTest) ... ok
test_getchildren (test.test_xml_etree.ElementTreeTest) ... ok
test_html_empty_elems_serialization (test.test_xml_etree.ElementTreeTest) ... ok
test_interface (test.test_xml_etree.ElementTreeTest) ... ok
test_issue18347 (test.test_xml_etree.ElementTreeTest) ... ok
test_iterparse (test.test_xml_etree.ElementTreeTest) ... ok
test_makeelement (test.test_xml_etree.ElementTreeTest) ... ok
test_methods (test.test_xml_etree.ElementTreeTest) ... ok
test_namespace (test.test_xml_etree.ElementTreeTest) ... ok
test_parsefile (test.test_xml_etree.ElementTreeTest) ... ok
test_parseliteral (test.test_xml_etree.ElementTreeTest) ... ok
test_path_cache (test.test_xml_etree.ElementTreeTest) ... ok
test_processinginstruction (test.test_xml_etree.ElementTreeTest) ... ok
test_qname (test.test_xml_etree.ElementTreeTest) ... ok
test_set_attribute (test.test_xml_etree.ElementTreeTest) ... ok
test_simpleops (test.test_xml_etree.ElementTreeTest) ... ok
test_writefile (test.test_xml_etree.ElementTreeTest) ... ok
test_writestring (test.test_xml_etree.ElementTreeTest) ... ok
test_xpath_tokenizer (test.test_xml_etree.ElementTreeTest) ... ok
test_encoding (test.test_xml_etree.IOTest) ... ok
test_read_from_stringio (test.test_xml_etree.IOTest) ... ok
test_read_from_user_reader (test.test_xml_etree.IOTest) ... ok
test_tostringlist_invariant (test.test_xml_etree.IOTest) ... ok
test_write_to_file (test.test_xml_etree.IOTest) ... ok
test_write_to_filename (test.test_xml_etree.IOTest) ... ok
test_write_to_stringio (test.test_xml_etree.IOTest) ... ok
test_write_to_user_writer (test.test_xml_etree.IOTest) ... ok
test_error_code (test.test_xml_etree.ParseErrorTest) ... ok
test_error_position (test.test_xml_etree.ParseErrorTest) ... ok
test_subclass (test.test_xml_etree.ParseErrorTest) ... ok
test_xinclude (test.test_xml_etree.XIncludeTest) ... ok
test_xinclude_default (test.test_xml_etree.XIncludeTest) ... ok
test_xinclude_failures (test.test_xml_etree.XIncludeTest) ... ok
test_Element_subclass_constructor (test.test_xml_etree.ElementTreeTypeTest) ... ok
test_Element_subclass_new_method (test.test_xml_etree.ElementTreeTypeTest) ... ok
test_Element_subclass_trivial (test.test_xml_etree.ElementTreeTypeTest) ... ok
test_istype (test.test_xml_etree.ElementTreeTypeTest) ... ok
test_bad_find (test.test_xml_etree.ElementFindTest) ... ok
test_find_simple (test.test_xml_etree.ElementFindTest) ... ok
test_find_through_ElementTree (test.test_xml_etree.ElementFindTest) ... ok
test_find_xpath (test.test_xml_etree.ElementFindTest) ... ok
test_findall (test.test_xml_etree.ElementFindTest) ... ok
test_simplefind (test.test_xml_etree.ElementFindTest) ... ok
test_test_find_with_ns (test.test_xml_etree.ElementFindTest) ... ok
test_basic (test.test_xml_etree.ElementIterTest) ... ok
test_copy (test.test_xml_etree.ElementIterTest) ... skipped 'unpickleable iteraters'
test_corners (test.test_xml_etree.ElementIterTest) ... ok
test_getiterator (test.test_xml_etree.ElementIterTest) ... ok
test_iter_by_tag (test.test_xml_etree.ElementIterTest) ... ok
test_pickle (test.test_xml_etree.ElementIterTest) ... skipped 'unpickleable iteraters'
test_builder_lookup_errors (test.test_xml_etree.TreeBuilderTest) ... skipped 'only for the C version'
test_doctype (test.test_xml_etree.TreeBuilderTest) ... ok
test_dummy_builder (test.test_xml_etree.TreeBuilderTest) ... ok
test_element_factory (test.test_xml_etree.TreeBuilderTest) ... ok
test_element_factory_subclass (test.test_xml_etree.TreeBuilderTest) ... ok
test_subclass (test.test_xml_etree.TreeBuilderTest) ... ok
test_treebuilder_elementfactory_none (test.test_xml_etree.TreeBuilderTest) ... ok
test_constructor_args (test.test_xml_etree.XMLParserTest) ... ok
test_doctype_warning (test.test_xml_etree.XMLParserTest) ... ok
test_subclass (test.test_xml_etree.XMLParserTest) ... ok
test_subclass_doctype (test.test_xml_etree.XMLParserTest) ... ok
test_bug_1534630 (test.test_xml_etree.BugsTest) ... ok
test_bug_200708_close (test.test_xml_etree.BugsTest) ... ok
test_bug_200708_newline (test.test_xml_etree.BugsTest) ... ok
test_bug_200709_default_namespace (test.test_xml_etree.BugsTest) ... ok
test_bug_200709_element_comment (test.test_xml_etree.BugsTest) ... ok
test_bug_200709_element_insert (test.test_xml_etree.BugsTest) ... ok
test_bug_200709_iter_comment (test.test_xml_etree.BugsTest) ... ok
test_bug_200709_register_namespace (test.test_xml_etree.BugsTest) ... ok
test_bug_xmltoolkit21 (test.test_xml_etree.BugsTest) ... ok
test_bug_xmltoolkit25 (test.test_xml_etree.BugsTest) ... ok
test_bug_xmltoolkit28 (test.test_xml_etree.BugsTest) ... ok
test_bug_xmltoolkit39 (test.test_xml_etree.BugsTest) ... ok
test_bug_xmltoolkit54 (test.test_xml_etree.BugsTest) ... ok
test_bug_xmltoolkit55 (test.test_xml_etree.BugsTest) ... ok
test_bug_xmltoolkit60 (test.test_xml_etree.BugsTest) ... ok
test_bug_xmltoolkit62 (test.test_xml_etree.BugsTest) ... ok
test_bug_xmltoolkit63 (test.test_xml_etree.BugsTest) ... skipped 'reference counting'
test_bug_xmltoolkitX1 (test.test_xml_etree.BugsTest) ... ok
test_expat224_utf8_bug (test.test_xml_etree.BugsTest) ... ok
test_expat224_utf8_bug_file (test.test_xml_etree.BugsTest) ... ok
test_issue10777 (test.test_xml_etree.BugsTest) ... ok
test_issue6233 (test.test_xml_etree.BugsTest) ... ok
test_issue6565 (test.test_xml_etree.BugsTest) ... ok
======================================================================
FAIL: test_encoding (test.test_xml_etree.ElementTreeTest)
----------------------------------------------------------------------
Traceback (most recent call last):
File "/buildbot/slave/pypy-c-jit-linux-x86-32/build/lib-python/2.7/test/test_xml_etree.py", line 784, in test_encoding
self.assertRaises(ValueError, ET.XML, bxml(encoding))
AssertionError: ValueError not raised
----------------------------------------------------------------------
Ran 120 tests in 0.101s
FAILED (failures=1, skipped=4)
Traceback (most recent call last):
File "/buildbot/slave/pypy-c-jit-linux-x86-32/build/pypy/tool/pytest/run-script/regrverbose.py", line 14, in <module>
indirect_test()
File "/buildbot/slave/pypy-c-jit-linux-x86-32/build/lib-python/2.7/test/test_xml_etree.py", line 2759, in test_main
support.run_unittest(*test_classes)
File "/buildbot/slave/pypy-c-jit-linux-x86-32/build/lib-python/2.7/test/support/__init__.py", line 1687, in run_unittest
_run_suite(suite)
File "/buildbot/slave/pypy-c-jit-linux-x86-32/build/lib-python/2.7/test/support/__init__.py", line 1578, in _run_suite
raise TestFailed(err)
TestFailed: Traceback (most recent call last):
File "/buildbot/slave/pypy-c-jit-linux-x86-32/build/lib-python/2.7/test/test_xml_etree.py", line 784, in test_encoding
self.assertRaises(ValueError, ET.XML, bxml(encoding))
AssertionError: ValueError not raised
_______________________________________ _______________________________________
test_bpo_31728 (test.test_xml_etree_c.MiscTests) ... skipped 'requires _elementtree'
test_del_attribute (test.test_xml_etree_c.MiscTests) ... skipped 'requires _elementtree'
test_length_overflow (test.test_xml_etree_c.MiscTests) ... skipped 'requires _elementtree'
----------------------------------------------------------------------
Ran 3 tests in 0.000s
OK (skipped=3)
test_sanity (test.test_xml_etree.ModuleTest) ... ok
test_delslice (test.test_xml_etree.ElementSlicingTest) ... ok
test_getslice_negative_steps (test.test_xml_etree.ElementSlicingTest) ... ok
test_getslice_range (test.test_xml_etree.ElementSlicingTest) ... ok
test_getslice_single_index (test.test_xml_etree.ElementSlicingTest) ... ok
test_getslice_steps (test.test_xml_etree.ElementSlicingTest) ... ok
test_setslice_negative_steps (test.test_xml_etree.ElementSlicingTest) ... ok
test_setslice_range (test.test_xml_etree.ElementSlicingTest) ... ok
test_setslice_single_index (test.test_xml_etree.ElementSlicingTest) ... ok
test_setslice_steps (test.test_xml_etree.ElementSlicingTest) ... ok
test_cyclic_gc (test.test_xml_etree.BasicElementTest) ... ok
test_get_keyword_args (test.test_xml_etree.BasicElementTest) ... ok
test_weakref (test.test_xml_etree.BasicElementTest) ... ok
test_ass_subscr (test.test_xml_etree.BadElementTest) ... ok
test_element_get_tail (test.test_xml_etree.BadElementTest) ... ok
test_element_get_text (test.test_xml_etree.BadElementTest) ... ok
test_element_iter (test.test_xml_etree.BadElementTest) ... ok
test_extend_mutable_list (test.test_xml_etree.BadElementTest) ... ok
test_extend_mutable_list2 (test.test_xml_etree.BadElementTest) ... ok
test_recursive_repr (test.test_xml_etree.BadElementTest) ... ok
test_remove_with_mutating (test.test_xml_etree.BadElementTest) ... ok
test_subscr (test.test_xml_etree.BadElementTest) ... ok
test_find_with_error (test.test_xml_etree.BadElementPathTest) ... ok
test_find_with_mutating (test.test_xml_etree.BadElementPathTest) ... ok
test_findall_with_error (test.test_xml_etree.BadElementPathTest) ... ok
test_findall_with_mutating (test.test_xml_etree.BadElementPathTest) ... ok
test_findtext_with_error (test.test_xml_etree.BadElementPathTest) ... ok
test_findtext_with_mutating (test.test_xml_etree.BadElementPathTest) ... ok
test_attlist_default (test.test_xml_etree.ElementTreeTest) ... ok
test_attrib (test.test_xml_etree.ElementTreeTest) ... ok
test_cdata (test.test_xml_etree.ElementTreeTest) ... ok
test_copy (test.test_xml_etree.ElementTreeTest) ... ok
test_custom_builder (test.test_xml_etree.ElementTreeTest) ... ok
test_doctype_public (test.test_xml_etree.ElementTreeTest) ... ok
test_encoding (test.test_xml_etree.ElementTreeTest) ... FAIL
test_entity (test.test_xml_etree.ElementTreeTest) ... ok
test_file_init (test.test_xml_etree.ElementTreeTest) ... ok
test_getchildren (test.test_xml_etree.ElementTreeTest) ... ok
test_html_empty_elems_serialization (test.test_xml_etree.ElementTreeTest) ... ok
test_interface (test.test_xml_etree.ElementTreeTest) ... ok
test_issue18347 (test.test_xml_etree.ElementTreeTest) ... ok
test_iterparse (test.test_xml_etree.ElementTreeTest) ... ok
test_makeelement (test.test_xml_etree.ElementTreeTest) ... ok
test_methods (test.test_xml_etree.ElementTreeTest) ... ok
test_namespace (test.test_xml_etree.ElementTreeTest) ... ok
test_parsefile (test.test_xml_etree.ElementTreeTest) ... ok
test_parseliteral (test.test_xml_etree.ElementTreeTest) ... ok
test_path_cache (test.test_xml_etree.ElementTreeTest) ... ok
test_processinginstruction (test.test_xml_etree.ElementTreeTest) ... ok
test_qname (test.test_xml_etree.ElementTreeTest) ... ok
test_set_attribute (test.test_xml_etree.ElementTreeTest) ... ok
test_simpleops (test.test_xml_etree.ElementTreeTest) ... ok
test_writefile (test.test_xml_etree.ElementTreeTest) ... ok
test_writestring (test.test_xml_etree.ElementTreeTest) ... ok
test_xpath_tokenizer (test.test_xml_etree.ElementTreeTest) ... ok
test_encoding (test.test_xml_etree.IOTest) ... ok
test_read_from_stringio (test.test_xml_etree.IOTest) ... ok
test_read_from_user_reader (test.test_xml_etree.IOTest) ... ok
test_tostringlist_invariant (test.test_xml_etree.IOTest) ... ok
test_write_to_file (test.test_xml_etree.IOTest) ... ok
test_write_to_filename (test.test_xml_etree.IOTest) ... ok
test_write_to_stringio (test.test_xml_etree.IOTest) ... ok
test_write_to_user_writer (test.test_xml_etree.IOTest) ... ok
test_error_code (test.test_xml_etree.ParseErrorTest) ... ok
test_error_position (test.test_xml_etree.ParseErrorTest) ... ok
test_subclass (test.test_xml_etree.ParseErrorTest) ... ok
test_xinclude (test.test_xml_etree.XIncludeTest) ... ok
test_xinclude_default (test.test_xml_etree.XIncludeTest) ... ok
test_xinclude_failures (test.test_xml_etree.XIncludeTest) ... ok
test_Element_subclass_constructor (test.test_xml_etree.ElementTreeTypeTest) ... ok
test_Element_subclass_new_method (test.test_xml_etree.ElementTreeTypeTest) ... ok
test_Element_subclass_trivial (test.test_xml_etree.ElementTreeTypeTest) ... ok
test_istype (test.test_xml_etree.ElementTreeTypeTest) ... ok
test_bad_find (test.test_xml_etree.ElementFindTest) ... ok
test_find_simple (test.test_xml_etree.ElementFindTest) ... ok
test_find_through_ElementTree (test.test_xml_etree.ElementFindTest) ... ok
test_find_xpath (test.test_xml_etree.ElementFindTest) ... ok
test_findall (test.test_xml_etree.ElementFindTest) ... ok
test_simplefind (test.test_xml_etree.ElementFindTest) ... ok
test_test_find_with_ns (test.test_xml_etree.ElementFindTest) ... ok
test_basic (test.test_xml_etree.ElementIterTest) ... ok
test_copy (test.test_xml_etree.ElementIterTest) ... skipped 'unpickleable iteraters'
test_corners (test.test_xml_etree.ElementIterTest) ... ok
test_getiterator (test.test_xml_etree.ElementIterTest) ... ok
test_iter_by_tag (test.test_xml_etree.ElementIterTest) ... ok
test_pickle (test.test_xml_etree.ElementIterTest) ... skipped 'unpickleable iteraters'
test_builder_lookup_errors (test.test_xml_etree.TreeBuilderTest) ... skipped 'only for the C version'
test_doctype (test.test_xml_etree.TreeBuilderTest) ... ok
test_dummy_builder (test.test_xml_etree.TreeBuilderTest) ... ok
test_element_factory (test.test_xml_etree.TreeBuilderTest) ... ok
test_element_factory_subclass (test.test_xml_etree.TreeBuilderTest) ... ok
test_subclass (test.test_xml_etree.TreeBuilderTest) ... ok
test_treebuilder_elementfactory_none (test.test_xml_etree.TreeBuilderTest) ... ok
test_constructor_args (test.test_xml_etree.XMLParserTest) ... ok
test_doctype_warning (test.test_xml_etree.XMLParserTest) ... ok
test_subclass (test.test_xml_etree.XMLParserTest) ... ok
test_subclass_doctype (test.test_xml_etree.XMLParserTest) ... ok
test_bug_1534630 (test.test_xml_etree.BugsTest) ... ok
test_bug_200708_close (test.test_xml_etree.BugsTest) ... ok
test_bug_200708_newline (test.test_xml_etree.BugsTest) ... ok
test_bug_200709_default_namespace (test.test_xml_etree.BugsTest) ... ok
test_bug_200709_element_comment (test.test_xml_etree.BugsTest) ... ok
test_bug_200709_element_insert (test.test_xml_etree.BugsTest) ... ok
test_bug_200709_iter_comment (test.test_xml_etree.BugsTest) ... ok
test_bug_200709_register_namespace (test.test_xml_etree.BugsTest) ... ok
test_bug_xmltoolkit21 (test.test_xml_etree.BugsTest) ... ok
test_bug_xmltoolkit25 (test.test_xml_etree.BugsTest) ... ok
test_bug_xmltoolkit28 (test.test_xml_etree.BugsTest) ... ok
test_bug_xmltoolkit39 (test.test_xml_etree.BugsTest) ... ok
test_bug_xmltoolkit54 (test.test_xml_etree.BugsTest) ... ok
test_bug_xmltoolkit55 (test.test_xml_etree.BugsTest) ... ok
test_bug_xmltoolkit60 (test.test_xml_etree.BugsTest) ... ok
test_bug_xmltoolkit62 (test.test_xml_etree.BugsTest) ... ok
test_bug_xmltoolkit63 (test.test_xml_etree.BugsTest) ... skipped 'reference counting'
test_bug_xmltoolkitX1 (test.test_xml_etree.BugsTest) ... ok
test_expat224_utf8_bug (test.test_xml_etree.BugsTest) ... ok
test_expat224_utf8_bug_file (test.test_xml_etree.BugsTest) ... ok
test_issue10777 (test.test_xml_etree.BugsTest) ... ok
test_issue6233 (test.test_xml_etree.BugsTest) ... ok
test_issue6565 (test.test_xml_etree.BugsTest) ... ok
======================================================================
FAIL: test_encoding (test.test_xml_etree.ElementTreeTest)
----------------------------------------------------------------------
Traceback (most recent call last):
File "/buildbot/slave/pypy-c-jit-linux-x86-32/build/lib-python/2.7/test/test_xml_etree.py", line 784, in test_encoding
self.assertRaises(ValueError, ET.XML, bxml(encoding))
AssertionError: ValueError not raised
----------------------------------------------------------------------
Ran 120 tests in 0.100s
FAILED (failures=1, skipped=4)
Traceback (most recent call last):
File "/buildbot/slave/pypy-c-jit-linux-x86-32/build/pypy/tool/pytest/run-script/regrverbose.py", line 14, in <module>
indirect_test()
File "/buildbot/slave/pypy-c-jit-linux-x86-32/build/lib-python/2.7/test/test_xml_etree_c.py", line 90, in test_main
test_xml_etree.test_main(module=cET)
File "/buildbot/slave/pypy-c-jit-linux-x86-32/build/lib-python/2.7/test/test_xml_etree.py", line 2759, in test_main
support.run_unittest(*test_classes)
File "/buildbot/slave/pypy-c-jit-linux-x86-32/build/lib-python/2.7/test/support/__init__.py", line 1687, in run_unittest
_run_suite(suite)
File "/buildbot/slave/pypy-c-jit-linux-x86-32/build/lib-python/2.7/test/support/__init__.py", line 1578, in _run_suite
raise TestFailed(err)
TestFailed: Traceback (most recent call last):
File "/buildbot/slave/pypy-c-jit-linux-x86-32/build/lib-python/2.7/test/test_xml_etree.py", line 784, in test_encoding
self.assertRaises(ValueError, ET.XML, bxml(encoding))
AssertionError: ValueError not raised
=========================== short test summary info ============================
FAIL lib-python/2.7/test/test_xml_etree.py::unmodified
FAIL lib-python/2.7/test/test_xml_etree_c.py::unmodified
========================== slowest 10 test durations ===========================
203.39s call lib-python/2.7/test/test_zipfile64.py::unmodified
120.22s call lib-python/2.7/test/test_smtpnet.py::unmodified
118.24s call lib-python/2.7/test/test_xpickle.py::unmodified
43.52s call lib-python/2.7/test/test_multiprocessing.py::unmodified
27.74s call lib-python/2.7/test/test_io.py::unmodified
20.34s call lib-python/2.7/test/test_subprocess.py::unmodified
15.68s call lib-python/2.7/test/test_socket.py::unmodified
11.43s call lib-python/2.7/test/test_file2k.py::unmodified
11.10s call lib-python/2.7/test/test_select.py::unmodified
11.04s call lib-python/2.7/test/test_hashlib.py::unmodified
============== 2 failed, 360 passed, 44 skipped in 836.06 seconds ==============
program finished with exit code 1
elapsedTime=837.375757