python testrunner/lib_python_tests.py
in dir /buildbot/slave/pypy-c-jit-linux-x86-32/build (timeout 4000 secs)
watching logfiles {'pytestLog': 'cpython.log'}
argv: ['python', 'testrunner/lib_python_tests.py']
environment:
AUDITWHEEL_ARCH=i686
AUDITWHEEL_PLAT=manylinux_2_28_i686
AUDITWHEEL_POLICY=manylinux_2_28
DEVTOOLSET_ROOTPATH=/opt/rh/gcc-toolset-14/root
HGDEMANDIMPORT=disable
HOME=/home/buildworker
HOSTNAME=Debian-trixie-latest-amd64-base
LANG=en_US.UTF-8
LANGUAGE=en_US.UTF-8
LC_ALL=en_US.UTF-8
LD_LIBRARY_PATH=/usr/local/lib:/opt/rh/gcc-toolset-14/root/usr/lib64:/opt/rh/gcc-toolset-14/root/usr/lib:/opt/rh/gcc-toolset-14/root/usr/lib64/dyninst:/opt/rh/gcc-toolset-14/root/usr/lib/dyninst
OLDPWD=/buildbot/slave
PATH=/tmp/venv/bin:/opt/clang/bin:/opt/rh/gcc-toolset-14/root/usr/bin:/usr/local/sbin:/usr/local/bin:/usr/sbin:/usr/bin:/sbin:/bin:/opt/pypy2.7-v7.3.23-linux32/bin
PKG_CONFIG_PATH=/usr/local/lib/pkgconfig
PS1=(venv)
PWD=/buildbot/slave/pypy-c-jit-linux-x86-32/build
PYPY_LOCALBASE=/usr/local
PYPY_MAKE_PORTABLE=1
SETUPTOOLS_USE_DISTUTILS=stdlib
SHLVL=1
SSL_CERT_FILE=/opt/_internal/certs.pem
TERM=xterm
TMPDIR=/tmp/pytest
VIRTUAL_ENV=/tmp/venv
container=podman
using PTY: False
/tmp/venv/site-packages/hypothesis/extra/pytestplugin.py:61: HypothesisWarning:
You are using Pytest version 2.9.2. Hypothesis tests work with any test
runner, but our Pytest plugin requires Pytest 4.3 or newer.
Note that the Pytest developers no longer support this version either!
Disabling the Hypothesis pytest plugin...
warnings.warn(PYTEST_TOO_OLD_MESSAGE % (pytest.__version__,), HypothesisWarning)
============================= test session starts ==============================
platform linux2 -- Python 2.7.18[pypy-7.3.23-final], pytest-2.9.2, py-1.4.29, pluggy-0.3.1
rootdir: /buildbot/slave/pypy-c-jit-linux-x86-32/build, inifile: pytest.ini
plugins: hypothesis-4.57.1
collected 433 items
lib-python/3/test/test___all__.py .
lib-python/3/test/test__locale.py .
lib-python/3/test/test__opcode.py .
lib-python/3/test/test__osx_support.py .
lib-python/3/test/test__xxsubinterpreters.py .
lib-python/3/test/test_abc.py .
lib-python/3/test/test_abstract_numbers.py .
lib-python/3/test/test_aifc.py .
lib-python/3/test/test_argparse.py .
lib-python/3/test/test_array.py .
lib-python/3/test/test_asdl_parser.py .
lib-python/3/test/test_ast.py .
lib-python/3/test/test_asyncgen.py .
lib-python/3/test/test_asynchat.py .
lib-python/3/test/test_asyncore.py .
lib-python/3/test/test_atexit.py .
lib-python/3/test/test_audioop.py .
lib-python/3/test/test_audit.py .
lib-python/3/test/test_augassign.py .
lib-python/3/test/test_base64.py .
lib-python/3/test/test_baseexception.py .
lib-python/3/test/test_bdb.py .
lib-python/3/test/test_bigaddrspace.py .
lib-python/3/test/test_bigmem.py .
lib-python/3/test/test_binascii.py .
lib-python/3/test/test_binop.py .
lib-python/3/test/test_bisect.py .
lib-python/3/test/test_bool.py .
lib-python/3/test/test_buffer.py .
lib-python/3/test/test_bufio.py .
lib-python/3/test/test_builtin.py .
lib-python/3/test/test_bytes.py .
lib-python/3/test/test_bz2.py .
lib-python/3/test/test_c_locale_coercion.py .
lib-python/3/test/test_calendar.py .
lib-python/3/test/test_call.py .
lib-python/3/test/test_cgi.py .
lib-python/3/test/test_cgitb.py .
lib-python/3/test/test_charmapcodec.py .
lib-python/3/test/test_check_c_globals.py .
lib-python/3/test/test_class.py .
lib-python/3/test/test_clinic.py .
lib-python/3/test/test_cmath.py .
lib-python/3/test/test_cmd.py .
lib-python/3/test/test_cmd_line.py .
lib-python/3/test/test_cmd_line_script.py .
lib-python/3/test/test_code.py .
lib-python/3/test/test_code_module.py .
lib-python/3/test/test_codeccallbacks.py .
lib-python/3/test/test_codecencodings_cn.py .
lib-python/3/test/test_codecencodings_hk.py .
lib-python/3/test/test_codecencodings_iso2022.py .
lib-python/3/test/test_codecencodings_jp.py .
lib-python/3/test/test_codecencodings_kr.py .
lib-python/3/test/test_codecencodings_tw.py .
lib-python/3/test/test_codecmaps_cn.py .
lib-python/3/test/test_codecmaps_hk.py .
lib-python/3/test/test_codecmaps_jp.py .
lib-python/3/test/test_codecmaps_kr.py .
lib-python/3/test/test_codecmaps_tw.py .
lib-python/3/test/test_codecs.py .
lib-python/3/test/test_codeop.py .
lib-python/3/test/test_collections.py .
lib-python/3/test/test_colorsys.py .
lib-python/3/test/test_compare.py .
lib-python/3/test/test_compile.py .
lib-python/3/test/test_compileall.py .
lib-python/3/test/test_complex.py .
lib-python/3/test/test_configparser.py .
lib-python/3/test/test_contains.py .
lib-python/3/test/test_context.py .
lib-python/3/test/test_contextlib.py .
lib-python/3/test/test_contextlib_async.py .
lib-python/3/test/test_copy.py .
lib-python/3/test/test_copyreg.py .
lib-python/3/test/test_coroutines.py .
lib-python/3/test/test_cprofile.py .
lib-python/3/test/test_crashers.py .
lib-python/3/test/test_crypt.py .
lib-python/3/test/test_csv.py .
lib-python/3/test/test_ctypes.py .
lib-python/3/test/test_curses.py .
lib-python/3/test/test_datetime.py .
lib-python/3/test/test_dbm.py .
lib-python/3/test/test_dbm_dumb.py .
lib-python/3/test/test_dbm_gnu.py .
lib-python/3/test/test_dbm_ndbm.py .
lib-python/3/test/test_decimal.py .
lib-python/3/test/test_decorators.py .
lib-python/3/test/test_defaultdict.py .
lib-python/3/test/test_deque.py .
lib-python/3/test/test_descr.py .
lib-python/3/test/test_descrtut.py .
lib-python/3/test/test_devpoll.py .
lib-python/3/test/test_dict.py .
lib-python/3/test/test_dict_version.py s
lib-python/3/test/test_dictcomps.py .
lib-python/3/test/test_dictviews.py .
lib-python/3/test/test_difflib.py .
lib-python/3/test/test_dis.py s
lib-python/3/test/test_distutils.py .
lib-python/3/test/test_docxmlrpc.py .
lib-python/3/test/test_dtrace.py .
lib-python/3/test/test_dynamic.py .
lib-python/3/test/test_dynamicclassattribute.py .
lib-python/3/test/test_eintr.py .
lib-python/3/test/test_embed.py .
lib-python/3/test/test_ensurepip.py .
lib-python/3/test/test_enum.py .
lib-python/3/test/test_enumerate.py .
lib-python/3/test/test_eof.py .
lib-python/3/test/test_epoll.py .
lib-python/3/test/test_errno.py .
lib-python/3/test/test_except_star.py .
lib-python/3/test/test_exception_group.py .
lib-python/3/test/test_exception_hierarchy.py .
lib-python/3/test/test_exception_variations.py .
lib-python/3/test/test_exceptions.py .
lib-python/3/test/test_extcall.py .
lib-python/3/test/test_faulthandler.py .
lib-python/3/test/test_fcntl.py .
lib-python/3/test/test_file.py .
lib-python/3/test/test_file_eintr.py .
lib-python/3/test/test_filecmp.py .
lib-python/3/test/test_fileinput.py .
lib-python/3/test/test_fileio.py .
lib-python/3/test/test_fileutils.py .
lib-python/3/test/test_finalization.py .
lib-python/3/test/test_float.py .
lib-python/3/test/test_flufl.py .
lib-python/3/test/test_fnmatch.py .
lib-python/3/test/test_fork1.py .
lib-python/3/test/test_format.py .
lib-python/3/test/test_fractions.py .
lib-python/3/test/test_frame.py .
lib-python/3/test/test_frozen.py s
lib-python/3/test/test_fstring.py .
lib-python/3/test/test_ftplib.py .
lib-python/3/test/test_funcattrs.py .
lib-python/3/test/test_functools.py .
lib-python/3/test/test_gc.py s
lib-python/3/test/test_generator_stop.py .
lib-python/3/test/test_generators.py .
lib-python/3/test/test_genericalias.py .
lib-python/3/test/test_genericclass.py .
lib-python/3/test/test_genericpath.py .
lib-python/3/test/test_genexps.py .
lib-python/3/test/test_getopt.py .
lib-python/3/test/test_getpass.py .
lib-python/3/test/test_getpath.py s
lib-python/3/test/test_gettext.py .
lib-python/3/test/test_glob.py .
lib-python/3/test/test_global.py .
lib-python/3/test/test_grammar.py .
lib-python/3/test/test_graphlib.py .
lib-python/3/test/test_grp.py .
lib-python/3/test/test_gzip.py .
lib-python/3/test/test_hash.py .
lib-python/3/test/test_hashlib.py .
lib-python/3/test/test_heapq.py .
lib-python/3/test/test_hmac.py .
lib-python/3/test/test_html.py .
lib-python/3/test/test_htmlparser.py .
lib-python/3/test/test_http_cookiejar.py .
lib-python/3/test/test_http_cookies.py .
lib-python/3/test/test_httplib.py .
lib-python/3/test/test_httpservers.py .
lib-python/3/test/test_idle.py .
lib-python/3/test/test_imaplib.py .
lib-python/3/test/test_imghdr.py .
lib-python/3/test/test_imp.py .
lib-python/3/test/test_index.py .
lib-python/3/test/test_int.py .
lib-python/3/test/test_int_literal.py .
lib-python/3/test/test_interpreters.py .
lib-python/3/test/test_io.py .
lib-python/3/test/test_ioctl.py .
lib-python/3/test/test_ipaddress.py .
lib-python/3/test/test_isinstance.py .
lib-python/3/test/test_iter.py .
lib-python/3/test/test_iterlen.py .
lib-python/3/test/test_itertools.py .
lib-python/3/test/test_keyword.py .
lib-python/3/test/test_keywordonlyarg.py .
lib-python/3/test/test_kqueue.py .
lib-python/3/test/test_largefile.py .
lib-python/3/test/test_launcher.py .
lib-python/3/test/test_lib2to3.py .
lib-python/3/test/test_linecache.py .
lib-python/3/test/test_list.py .
lib-python/3/test/test_listcomps.py .
lib-python/3/test/test_lltrace.py .
lib-python/3/test/test_locale.py .
lib-python/3/test/test_logging.py .
lib-python/3/test/test_long.py .
lib-python/3/test/test_longexp.py .
lib-python/3/test/test_lzma.py .
lib-python/3/test/test_mailbox.py .
lib-python/3/test/test_mailcap.py .
lib-python/3/test/test_marshal.py .
lib-python/3/test/test_math.py .
lib-python/3/test/test_memoryio.py .
lib-python/3/test/test_memoryview.py .
lib-python/3/test/test_metaclass.py .
lib-python/3/test/test_mimetypes.py .
lib-python/3/test/test_minidom.py .
lib-python/3/test/test_mmap.py .
lib-python/3/test/test_modulefinder.py .
lib-python/3/test/test_msilib.py .
lib-python/3/test/test_multibytecodec.py .
lib-python/3/test/test_multiprocessing_main_handling.py .
lib-python/3/test/test_named_expressions.py .
lib-python/3/test/test_netrc.py .
lib-python/3/test/test_nis.py .
lib-python/3/test/test_nntplib.py .
lib-python/3/test/test_ntpath.py .
lib-python/3/test/test_numeric_tower.py .
lib-python/3/test/test_opcache.py .
lib-python/3/test/test_opcodes.py .
lib-python/3/test/test_openpty.py .
lib-python/3/test/test_operator.py .
lib-python/3/test/test_optparse.py .
lib-python/3/test/test_ordered_dict.py .
lib-python/3/test/test_os.py F
lib-python/3/test/test_ossaudiodev.py s
lib-python/3/test/test_osx_env.py .
lib-python/3/test/test_pathlib.py .
lib-python/3/test/test_patma.py .
lib-python/3/test/test_pdb.py .
lib-python/3/test/test_peepholer.py .
lib-python/3/test/test_pep646_syntax.py .
lib-python/3/test/test_pickle.py .
lib-python/3/test/test_picklebuffer.py .
lib-python/3/test/test_pickletools.py .
lib-python/3/test/test_pipes.py .
lib-python/3/test/test_pkg.py .
lib-python/3/test/test_pkgutil.py .
lib-python/3/test/test_platform.py .
lib-python/3/test/test_plistlib.py .
lib-python/3/test/test_poll.py .
lib-python/3/test/test_popen.py .
lib-python/3/test/test_poplib.py .
lib-python/3/test/test_positional_only_arg.py .
lib-python/3/test/test_posix.py .
lib-python/3/test/test_posixpath.py .
lib-python/3/test/test_pow.py .
lib-python/3/test/test_pprint.py .
lib-python/3/test/test_print.py .
lib-python/3/test/test_profile.py .
lib-python/3/test/test_property.py .
lib-python/3/test/test_pstats.py .
lib-python/3/test/test_pty.py .
lib-python/3/test/test_pulldom.py .
lib-python/3/test/test_pwd.py .
lib-python/3/test/test_py_compile.py .
lib-python/3/test/test_pyclbr.py .
lib-python/3/test/test_pyexpat.py .
lib-python/3/test/test_queue.py .
lib-python/3/test/test_quopri.py .
lib-python/3/test/test_raise.py .
lib-python/3/test/test_random.py .
lib-python/3/test/test_range.py .
lib-python/3/test/test_re.py .
lib-python/3/test/test_readline.py .
lib-python/3/test/test_regrtest.py .
lib-python/3/test/test_repl.py .
lib-python/3/test/test_reprlib.py .
lib-python/3/test/test_resource.py .
lib-python/3/test/test_richcmp.py .
lib-python/3/test/test_rlcompleter.py .
lib-python/3/test/test_robotparser.py .
lib-python/3/test/test_runpy.py .
lib-python/3/test/test_sax.py .
lib-python/3/test/test_sched.py .
lib-python/3/test/test_scope.py .
lib-python/3/test/test_script_helper.py .
lib-python/3/test/test_secrets.py .
lib-python/3/test/test_select.py .
lib-python/3/test/test_selectors.py .
lib-python/3/test/test_set.py .
lib-python/3/test/test_setcomps.py .
lib-python/3/test/test_shelve.py .
lib-python/3/test/test_shlex.py .
lib-python/3/test/test_shutil.py .
lib-python/3/test/test_signal.py .
lib-python/3/test/test_site.py .
lib-python/3/test/test_slice.py .
lib-python/3/test/test_smtpd.py .
lib-python/3/test/test_smtplib.py .
lib-python/3/test/test_smtpnet.py .
lib-python/3/test/test_sndhdr.py .
lib-python/3/test/test_socket.py .
lib-python/3/test/test_socketserver.py .
lib-python/3/test/test_sort.py .
lib-python/3/test/test_source_encoding.py .
lib-python/3/test/test_spwd.py .
lib-python/3/test/test_ssl.py .
lib-python/3/test/test_stable_abi_ctypes.py s
lib-python/3/test/test_startfile.py .
lib-python/3/test/test_stat.py .
lib-python/3/test/test_statistics.py .
lib-python/3/test/test_strftime.py .
lib-python/3/test/test_string.py .
lib-python/3/test/test_string_literals.py .
lib-python/3/test/test_stringprep.py .
lib-python/3/test/test_strptime.py .
lib-python/3/test/test_strtod.py .
lib-python/3/test/test_struct.py .
lib-python/3/test/test_structseq.py .
lib-python/3/test/test_subclassinit.py .
lib-python/3/test/test_subprocess.py .
lib-python/3/test/test_sunau.py .
lib-python/3/test/test_sundry.py .
lib-python/3/test/test_super.py .
lib-python/3/test/test_support.py .
lib-python/3/test/test_symtable.py s
lib-python/3/test/test_syntax.py .
lib-python/3/test/test_sys.py .
lib-python/3/test/test_sys_setprofile.py .
lib-python/3/test/test_sys_settrace.py .
lib-python/3/test/test_sysconfig.py .
lib-python/3/test/test_sysconfig_pypy.py .
lib-python/3/test/test_syslog.py .
lib-python/3/test/test_tabnanny.py .
lib-python/3/test/test_tarfile.py .
lib-python/3/test/test_tcl.py .
lib-python/3/test/test_telnetlib.py .
lib-python/3/test/test_tempfile.py .
lib-python/3/test/test_termios.py .
lib-python/3/test/test_textwrap.py .
lib-python/3/test/test_thread.py .
lib-python/3/test/test_threadedtempfile.py .
lib-python/3/test/test_threading.py .
lib-python/3/test/test_threading_local.py .
lib-python/3/test/test_threadsignals.py .
lib-python/3/test/test_time.py .
lib-python/3/test/test_timeit.py .
lib-python/3/test/test_timeout.py .
lib-python/3/test/test_tix.py s
lib-python/3/test/test_tk.py s
lib-python/3/test/test_tokenize.py .
lib-python/3/test/test_trace.py .
lib-python/3/test/test_traceback.py .
lib-python/3/test/test_tracemalloc.py .
lib-python/3/test/test_ttk_guionly.py s
lib-python/3/test/test_ttk_textonly.py .
lib-python/3/test/test_tty.py .
lib-python/3/test/test_tuple.py .
lib-python/3/test/test_turtle.py .
lib-python/3/test/test_type_annotations.py .
lib-python/3/test/test_type_cache.py .
lib-python/3/test/test_type_comments.py .
lib-python/3/test/test_typechecks.py .
lib-python/3/test/test_types.py .
lib-python/3/test/test_typing.py .
lib-python/3/test/test_ucn.py .
lib-python/3/test/test_unary.py .
lib-python/3/test/test_unicode.py .
lib-python/3/test/test_unicode_file.py .
lib-python/3/test/test_unicode_file_functions.py .
lib-python/3/test/test_unicode_identifiers.py .
lib-python/3/test/test_unicodedata.py .
lib-python/3/test/test_unittest.py .
lib-python/3/test/test_univnewlines.py .
lib-python/3/test/test_unpack.py .
lib-python/3/test/test_unpack_ex.py .
lib-python/3/test/test_unparse.py .
lib-python/3/test/test_urllib.py .
lib-python/3/test/test_urllib2.py .
lib-python/3/test/test_urllib2_localnet.py .
lib-python/3/test/test_urllib2net.py .
lib-python/3/test/test_urllib_response.py .
lib-python/3/test/test_urllibnet.py .
lib-python/3/test/test_urlparse.py .
lib-python/3/test/test_userdict.py .
lib-python/3/test/test_userlist.py .
lib-python/3/test/test_userstring.py .
lib-python/3/test/test_utf8_mode.py .
lib-python/3/test/test_utf8source.py .
lib-python/3/test/test_uu.py .
lib-python/3/test/test_uuid.py .
lib-python/3/test/test_venv.py .
lib-python/3/test/test_wait3.py .
lib-python/3/test/test_wait4.py .
lib-python/3/test/test_wave.py .
lib-python/3/test/test_weakref.py .
lib-python/3/test/test_weakset.py .
lib-python/3/test/test_webbrowser.py .
lib-python/3/test/test_winconsoleio.py .
lib-python/3/test/test_winreg.py .
lib-python/3/test/test_winsound.py s
lib-python/3/test/test_with.py .
lib-python/3/test/test_wsgiref.py .
lib-python/3/test/test_xdrlib.py .
lib-python/3/test/test_xml_dom_minicompat.py .
lib-python/3/test/test_xml_etree.py .
lib-python/3/test/test_xml_etree_c.py .
lib-python/3/test/test_xmlrpc.py .
lib-python/3/test/test_xmlrpc_net.py .
lib-python/3/test/test_xxlimited.py s
lib-python/3/test/test_xxtestfuzz.py s
lib-python/3/test/test_yield_from.py .
lib-python/3/test/test_zipapp.py .
lib-python/3/test/test_zipfile.py .
lib-python/3/test/test_zipfile64.py s
lib-python/3/test/test_zipimport.py .
lib-python/3/test/test_zipimport_support.py .
lib-python/3/test/test_zlib.py .
lib-python/3/test/test_asyncio .
lib-python/3/test/test_capi .
lib-python/3/test/test_concurrent_futures .
lib-python/3/test/test_cppext .
lib-python/3/test/test_dataclasses .
lib-python/3/test/test_doctest .
lib-python/3/test/test_email .
lib-python/3/test/test_future_stmt .
lib-python/3/test/test_gdb .
lib-python/3/test/test_import .
lib-python/3/test/test_importlib .
lib-python/3/test/test_inspect .
lib-python/3/test/test_json .
lib-python/3/test/test_module .
lib-python/3/test/test_multiprocessing_fork .
lib-python/3/test/test_multiprocessing_forkserver .
lib-python/3/test/test_multiprocessing_spawn .
lib-python/3/test/test_peg_generator .
lib-python/3/test/test_pydoc .
lib-python/3/test/test_pyrepl .
lib-python/3/test/test_sqlite3 .
lib-python/3/test/test_tomllib .
lib-python/3/test/test_tools s
lib-python/3/test/test_warnings .
lib-python/3/test/test_zoneinfo .
=================================== FAILURES ===================================
_______________________________________ _______________________________________
== PyPy 3.11.16 (9f6ac18e84b0, Sep 16 2026, 01:30:25) [PyPy 8.0.1-alpha0 with GCC 14.2.1 20250110 (Red Hat 14.2.1-11)]
== Linux-6.12.90+deb13-amd64-i686-with-glibc2.28 little-endian
== Python build: release with_assert
== cwd: /tmp/pytest/test_python_worker_425528æ
== CPU count: 6 (process) / 9 (system)
== encodings: locale=UTF-8 FS=utf-8
== resources (3): curses,gui,network
Using random seed: 3029317833
0:00:00 load avg: 1.48 Run 1 test sequentially
0:00:00 load avg: 1.48 [1/1] test_os
test_blocking (test.test_os.BlockingTests.test_blocking) ... ok
test_compare_to_walk (test.test_os.BytesFwalkTests.test_compare_to_walk) ... ok
test_dir_fd (test.test_os.BytesFwalkTests.test_dir_fd) ... ok
test_fd_leak (test.test_os.BytesFwalkTests.test_fd_leak) ... ok
test_file_like_path (test.test_os.BytesFwalkTests.test_file_like_path) ... ok
test_walk_bad_dir (test.test_os.BytesFwalkTests.test_walk_bad_dir) ... ok
test_walk_bad_dir2 (test.test_os.BytesFwalkTests.test_walk_bad_dir2) ... ok
test_walk_bottom_up (test.test_os.BytesFwalkTests.test_walk_bottom_up) ... ok
test_walk_named_pipe (test.test_os.BytesFwalkTests.test_walk_named_pipe) ... ok
test_walk_named_pipe2 (test.test_os.BytesFwalkTests.test_walk_named_pipe2) ... ok
test_walk_prune (test.test_os.BytesFwalkTests.test_walk_prune) ... ok
test_walk_symlink (test.test_os.BytesFwalkTests.test_walk_symlink) ... ok
test_walk_topdown (test.test_os.BytesFwalkTests.test_walk_topdown) ... ok
test_yields_correct_dir_fd (test.test_os.BytesFwalkTests.test_yields_correct_dir_fd) ... ok
test_file_like_path (test.test_os.BytesWalkTests.test_file_like_path) ... ok
test_walk_bad_dir (test.test_os.BytesWalkTests.test_walk_bad_dir) ... ok
test_walk_bad_dir2 (test.test_os.BytesWalkTests.test_walk_bad_dir2) ... ok
test_walk_bottom_up (test.test_os.BytesWalkTests.test_walk_bottom_up) ... ok
test_walk_many_open_files (test.test_os.BytesWalkTests.test_walk_many_open_files) ... ok
test_walk_named_pipe (test.test_os.BytesWalkTests.test_walk_named_pipe) ... ok
test_walk_named_pipe2 (test.test_os.BytesWalkTests.test_walk_named_pipe2) ... ok
test_walk_prune (test.test_os.BytesWalkTests.test_walk_prune) ... ok
test_walk_symlink (test.test_os.BytesWalkTests.test_walk_symlink) ... ok
test_walk_topdown (test.test_os.BytesWalkTests.test_walk_topdown) ... ok
test_cpu_count (test.test_os.CPUCountTests.test_cpu_count) ... ok
test_chown_gid (test.test_os.ChownFileTests.test_chown_gid) ... skipped 'test needs at least 2 groups'
test_chown_uid_gid_arguments_must_be_index (test.test_os.ChownFileTests.test_chown_uid_gid_arguments_must_be_index) ... ok
test_chown_with_root (test.test_os.ChownFileTests.test_chown_with_root) ... skipped 'test needs root privilege and more than one user'
test_chown_without_permission (test.test_os.ChownFileTests.test_chown_without_permission) ... ok
test_devnull (test.test_os.DevNullTests.test_devnull) ... ok
test_bad_fd (test.test_os.DeviceEncodingTests.test_bad_fd) ... ok
test_device_encoding (test.test_os.DeviceEncodingTests.test_device_encoding) ... skipped 'test requires a tty and either Windows or nl_langinfo(CODESET)'
test___repr__ (test.test_os.EnvironTests.test___repr__)
Check that the repr() of os.environ looks like environ({...}). ... ok
test_bool (test.test_os.EnvironTests.test_bool) ... ok
test_constructor (test.test_os.EnvironTests.test_constructor) ... ok
test_environb (test.test_os.EnvironTests.test_environb) ... ok
test_get (test.test_os.EnvironTests.test_get) ... ok
test_get_exec_path (test.test_os.EnvironTests.test_get_exec_path) ... ok
test_getitem (test.test_os.EnvironTests.test_getitem) ... ok
test_ior_operator (test.test_os.EnvironTests.test_ior_operator) ... ok
test_ior_operator_invalid_dicts (test.test_os.EnvironTests.test_ior_operator_invalid_dicts) ... ok
test_ior_operator_key_value_iterable (test.test_os.EnvironTests.test_ior_operator_key_value_iterable) ... ok
test_items (test.test_os.EnvironTests.test_items) ... ok
test_iter_error_when_changing_os_environ (test.test_os.EnvironTests.test_iter_error_when_changing_os_environ) ... ok
test_iter_error_when_changing_os_environ_items (test.test_os.EnvironTests.test_iter_error_when_changing_os_environ_items) ... ok
test_iter_error_when_changing_os_environ_values (test.test_os.EnvironTests.test_iter_error_when_changing_os_environ_values) ... ok
test_key_type (test.test_os.EnvironTests.test_key_type) ... ok
test_keys (test.test_os.EnvironTests.test_keys) ... ok
test_keyvalue_types (test.test_os.EnvironTests.test_keyvalue_types) ... ok
test_len (test.test_os.EnvironTests.test_len) ... ok
test_or_operator (test.test_os.EnvironTests.test_or_operator) ... ok
test_os_popen_iter (test.test_os.EnvironTests.test_os_popen_iter) ... ok
test_pop (test.test_os.EnvironTests.test_pop) ... ok
test_popitem (test.test_os.EnvironTests.test_popitem) ... ok
test_putenv_unsetenv (test.test_os.EnvironTests.test_putenv_unsetenv) ... ok
test_putenv_unsetenv_error (test.test_os.EnvironTests.test_putenv_unsetenv_error) ... ok
test_read (test.test_os.EnvironTests.test_read) ... ok
test_ror_operator (test.test_os.EnvironTests.test_ror_operator) ... ok
test_setdefault (test.test_os.EnvironTests.test_setdefault) ... ok
test_update (test.test_os.EnvironTests.test_update) ... ok
test_update2 (test.test_os.EnvironTests.test_update2) ... ok
test_values (test.test_os.EnvironTests.test_values) ... ok
test_write (test.test_os.EnvironTests.test_write) ... ok
test_eventfd_initval (test.test_os.EventfdTests.test_eventfd_initval) ... skipped 'requires os.eventfd'
test_eventfd_select (test.test_os.EventfdTests.test_eventfd_select) ... skipped 'requires os.eventfd'
test_eventfd_semaphore (test.test_os.EventfdTests.test_eventfd_semaphore) ... skipped 'requires os.eventfd'
test_execv_with_bad_arglist (test.test_os.ExecTests.test_execv_with_bad_arglist) ... ok
test_execve_invalid_env (test.test_os.ExecTests.test_execve_invalid_env) ... ok
test_execve_with_empty_path (test.test_os.ExecTests.test_execve_with_empty_path) ... skipped 'Win32-specific test'
test_execvpe_with_bad_arglist (test.test_os.ExecTests.test_execvpe_with_bad_arglist) ... ok
test_execvpe_with_bad_program (test.test_os.ExecTests.test_execvpe_with_bad_program) ... ok
test_internal_execvpe_str (test.test_os.ExecTests.test_internal_execvpe_str) ... ok
test_os_all (test.test_os.ExportsTests.test_os_all) ... ok
test_fds (test.test_os.ExtendedAttributeTests.test_fds) ... ok
test_lpath (test.test_os.ExtendedAttributeTests.test_lpath) ... ok
test_simple (test.test_os.ExtendedAttributeTests.test_simple) ... ok
test_dup (test.test_os.FDInheritanceTests.test_dup) ... ok
test_dup2 (test.test_os.FDInheritanceTests.test_dup2) ... ok
test_dup_nul (test.test_os.FDInheritanceTests.test_dup_nul) ... skipped 'win32-specific test'
test_dup_standard_stream (test.test_os.FDInheritanceTests.test_dup_standard_stream) ... ok
test_get_inheritable_cloexec (test.test_os.FDInheritanceTests.test_get_inheritable_cloexec) ... ok
test_get_set_inheritable (test.test_os.FDInheritanceTests.test_get_set_inheritable) ... ok
test_get_set_inheritable_badf (test.test_os.FDInheritanceTests.test_get_set_inheritable_badf) ... ok
test_get_set_inheritable_o_path (test.test_os.FDInheritanceTests.test_get_set_inheritable_o_path) ... skipped 'need os.O_PATH'
test_open (test.test_os.FDInheritanceTests.test_open) ... ok
test_openpty (test.test_os.FDInheritanceTests.test_openpty) ... ok
test_pipe (test.test_os.FDInheritanceTests.test_pipe) ... ok
test_set_inheritable_cloexec (test.test_os.FDInheritanceTests.test_set_inheritable_cloexec) ... ok
test_identity (test.test_os.FSEncodingTests.test_identity) ... ok
test_nop (test.test_os.FSEncodingTests.test_nop) ... ok
test_access (test.test_os.FileTests.test_access) ... ok
test_closerange (test.test_os.FileTests.test_closerange) ... ok
test_copy_file_range (test.test_os.FileTests.test_copy_file_range) ... skipped 'test needs os.copy_file_range()'
test_copy_file_range_invalid_values (test.test_os.FileTests.test_copy_file_range_invalid_values) ... skipped 'test needs os.copy_file_range()'
test_copy_file_range_offset (test.test_os.FileTests.test_copy_file_range_offset) ... skipped 'test needs os.copy_file_range()'
test_fdopen (test.test_os.FileTests.test_fdopen) ... ok
test_large_read (test.test_os.FileTests.test_large_read) ... skipped 'implementation detail specific to cpython'
test_open_keywords (test.test_os.FileTests.test_open_keywords) ... ok
test_read (test.test_os.FileTests.test_read) ... ok
test_rename (test.test_os.FileTests.test_rename) ... skipped 'implementation detail specific to cpython'
test_replace (test.test_os.FileTests.test_replace) ... ok
test_splice (test.test_os.FileTests.test_splice) ... skipped 'test needs os.splice()'
test_splice_invalid_values (test.test_os.FileTests.test_splice_invalid_values) ... skipped 'test needs os.splice()'
test_splice_offset_in (test.test_os.FileTests.test_splice_offset_in) ... skipped 'test needs os.splice()'
test_splice_offset_out (test.test_os.FileTests.test_splice_offset_out) ... skipped 'test needs os.splice()'
test_symlink_keywords (test.test_os.FileTests.test_symlink_keywords) ... ok
test_write (test.test_os.FileTests.test_write) ... ok
test_write_windows_console (test.test_os.FileTests.test_write_windows_console) ... skipped 'test specific to the Windows console'
test_fork (test.test_os.ForkTests.test_fork) ... ok
test_compare_to_walk (test.test_os.FwalkTests.test_compare_to_walk) ... ok
test_dir_fd (test.test_os.FwalkTests.test_dir_fd) ... ok
test_fd_leak (test.test_os.FwalkTests.test_fd_leak) ... FAIL
test_file_like_path (test.test_os.FwalkTests.test_file_like_path) ... ok
test_walk_bad_dir (test.test_os.FwalkTests.test_walk_bad_dir) ... ok
test_walk_bad_dir2 (test.test_os.FwalkTests.test_walk_bad_dir2) ... ok
test_walk_bottom_up (test.test_os.FwalkTests.test_walk_bottom_up) ... ok
test_walk_named_pipe (test.test_os.FwalkTests.test_walk_named_pipe) ... ok
test_walk_named_pipe2 (test.test_os.FwalkTests.test_walk_named_pipe2) ... ok
test_walk_prune (test.test_os.FwalkTests.test_walk_prune) ... ok
test_walk_symlink (test.test_os.FwalkTests.test_walk_symlink) ... ok
test_walk_topdown (test.test_os.FwalkTests.test_walk_topdown) ... ok
test_yields_correct_dir_fd (test.test_os.FwalkTests.test_yields_correct_dir_fd) ... ok
test_getrandom0 (test.test_os.GetRandomTests.test_getrandom0) ... skipped 'need os.getrandom()'
test_getrandom_nonblock (test.test_os.GetRandomTests.test_getrandom_nonblock) ... skipped 'need os.getrandom()'
test_getrandom_random (test.test_os.GetRandomTests.test_getrandom_random) ... skipped 'need os.getrandom()'
test_getrandom_type (test.test_os.GetRandomTests.test_getrandom_type) ... skipped 'need os.getrandom()'
test_getrandom_value (test.test_os.GetRandomTests.test_getrandom_value) ... skipped 'need os.getrandom()'
test_link (test.test_os.LinkTests.test_link) ... ok
test_link_bytes (test.test_os.LinkTests.test_link_bytes) ... ok
test_unicode_name (test.test_os.LinkTests.test_unicode_name) ... ok
test_getlogin (test.test_os.LoginTests.test_getlogin) ... skipped 'Skip due to platform/environment differences on *NIX buildbots'
test_exist_ok_existing_directory (test.test_os.MakedirTests.test_exist_ok_existing_directory) ... ok
test_exist_ok_existing_regular_file (test.test_os.MakedirTests.test_exist_ok_existing_regular_file) ... ok
test_exist_ok_s_isgid_directory (test.test_os.MakedirTests.test_exist_ok_s_isgid_directory) ... ok
test_makedir (test.test_os.MakedirTests.test_makedir) ... ok
test_mode (test.test_os.MakedirTests.test_mode) ... ok
test_win32_mkdir_700 (test.test_os.MakedirTests.test_win32_mkdir_700) ... skipped 'requires Windows'
test_memfd_create (test.test_os.MemfdCreateTests.test_memfd_create) ... ok
test_getcwd (test.test_os.MiscTests.test_getcwd) ... ok
test_getcwd_long_path (test.test_os.MiscTests.test_getcwd_long_path) ... Tested current directory length: 2000
ok
test_getcwdb (test.test_os.MiscTests.test_getcwdb) ... ok
test_directory_link_nonlocal (test.test_os.NonLocalSymlinkTests.test_directory_link_nonlocal)
The symlink target should resolve relative to the link, not relative ... ok
test_oserror_filename (test.test_os.OSErrorTests.test_oserror_filename) ... ok
test_path_t_converter (test.test_os.PathTConverterTests.test_path_t_converter) ... ok
test_path_t_converter_and_custom_class (test.test_os.PathTConverterTests.test_path_t_converter_and_custom_class) ... ok
test_listdir (test.test_os.Pep383Tests.test_listdir) ... ok
test_open (test.test_os.Pep383Tests.test_open) ... ok
test_stat (test.test_os.Pep383Tests.test_stat) ... ok
test_statvfs (test.test_os.Pep383Tests.test_statvfs) ... ok
test_getppid (test.test_os.PidTests.test_getppid) ... ok
test_waitpid (test.test_os.PidTests.test_waitpid) ... ok
test_waitpid_windows (test.test_os.PidTests.test_waitpid_windows) ... skipped 'win32-specific test'
test_waitstatus_to_exitcode (test.test_os.PidTests.test_waitstatus_to_exitcode) ... ok
test_waitstatus_to_exitcode_kill (test.test_os.PidTests.test_waitstatus_to_exitcode_kill) ... ok
test_waitstatus_to_exitcode_windows (test.test_os.PidTests.test_waitstatus_to_exitcode_windows) ... skipped 'win32-specific test'
test_setegid (test.test_os.PosixUidGidTests.test_setegid) ... ok
test_seteuid (test.test_os.PosixUidGidTests.test_seteuid) ... ok
test_setgid (test.test_os.PosixUidGidTests.test_setgid) ... ok
test_setregid (test.test_os.PosixUidGidTests.test_setregid) ... ok
test_setregid_neg1 (test.test_os.PosixUidGidTests.test_setregid_neg1) ... ok
test_setreuid (test.test_os.PosixUidGidTests.test_setreuid) ... ok
test_setreuid_neg1 (test.test_os.PosixUidGidTests.test_setreuid_neg1) ... ok
test_setuid (test.test_os.PosixUidGidTests.test_setuid) ... ok
test_set_get_priority (test.test_os.ProgramPriorityTests.test_set_get_priority) ... ok
test_bytes (test.test_os.ReadlinkTests.test_bytes) ... ok
test_missing_link (test.test_os.ReadlinkTests.test_missing_link) ... ok
test_not_symlink (test.test_os.ReadlinkTests.test_not_symlink) ... ok
test_pathlike (test.test_os.ReadlinkTests.test_pathlike) ... ok
test_pathlike_bytes (test.test_os.ReadlinkTests.test_pathlike_bytes) ... ok
test_remove_all (test.test_os.RemoveDirsTests.test_remove_all) ... ok
test_remove_nothing (test.test_os.RemoveDirsTests.test_remove_nothing) ... ok
test_remove_partial (test.test_os.RemoveDirsTests.test_remove_partial) ... ok
test_nowait (test.test_os.SpawnTests.test_nowait) ... ok
test_spawnl (test.test_os.SpawnTests.test_spawnl) ... ok
test_spawnl_noargs (test.test_os.SpawnTests.test_spawnl_noargs) ... ok
test_spawnle (test.test_os.SpawnTests.test_spawnle) ... ok
test_spawnle_noargs (test.test_os.SpawnTests.test_spawnle_noargs) ... ok
test_spawnlp (test.test_os.SpawnTests.test_spawnlp) ... ok
test_spawnlpe (test.test_os.SpawnTests.test_spawnlpe) ... ok
test_spawnv (test.test_os.SpawnTests.test_spawnv) ... ok
test_spawnv_noargs (test.test_os.SpawnTests.test_spawnv_noargs) ... ok
test_spawnve (test.test_os.SpawnTests.test_spawnve) ... ok
test_spawnve_bytes (test.test_os.SpawnTests.test_spawnve_bytes) ... ok
test_spawnve_invalid_env (test.test_os.SpawnTests.test_spawnve_invalid_env) ... ok
test_spawnve_noargs (test.test_os.SpawnTests.test_spawnve_noargs) ... ok
test_spawnvp (test.test_os.SpawnTests.test_spawnvp) ... ok
test_spawnvpe (test.test_os.SpawnTests.test_spawnvpe) ... ok
test_spawnvpe_invalid_env (test.test_os.SpawnTests.test_spawnvpe_invalid_env) ... ok
test_15261 (test.test_os.StatAttributeTests.test_15261) ... skipped 'Win32 specific tests'
test_1686475 (test.test_os.StatAttributeTests.test_1686475) ... skipped 'Win32 specific tests'
test_access_denied (test.test_os.StatAttributeTests.test_access_denied) ... skipped 'Win32 specific tests'
test_file_attributes (test.test_os.StatAttributeTests.test_file_attributes) ... skipped 'st_file_attributes is Win32 specific'
test_stat_attributes (test.test_os.StatAttributeTests.test_stat_attributes) ... ok
test_stat_attributes_bytes (test.test_os.StatAttributeTests.test_stat_attributes_bytes) ... ok
test_stat_block_device (test.test_os.StatAttributeTests.test_stat_block_device) ... skipped 'Win32 specific tests'
test_stat_result_pickle (test.test_os.StatAttributeTests.test_stat_result_pickle) ... ok
test_statvfs_attributes (test.test_os.StatAttributeTests.test_statvfs_attributes) ... ok
test_statvfs_result_pickle (test.test_os.StatAttributeTests.test_statvfs_result_pickle) ... ok
test_does_not_crash (test.test_os.TermsizeTests.test_does_not_crash)
Check if get_terminal_size() returns a meaningful value. ... skipped 'failed to query terminal size'
test_stty_match (test.test_os.TermsizeTests.test_stty_match)
Check if stty returns the same results ... skipped 'stty invocation failed'
test_uninstantiable (test.test_os.TestDirEntry.test_uninstantiable) ... ok
test_unpickable (test.test_os.TestDirEntry.test_unpickable) ... ok
test_blocking (test.test_os.TestInvalidFD.test_blocking) ... ok
test_closerange (test.test_os.TestInvalidFD.test_closerange) ... ok
test_dup (test.test_os.TestInvalidFD.test_dup) ... ok
test_dup2 (test.test_os.TestInvalidFD.test_dup2) ... ok
test_dup2_negative_fd (test.test_os.TestInvalidFD.test_dup2_negative_fd) ... ok
test_fchdir (test.test_os.TestInvalidFD.test_fchdir) ... ok
test_fchmod (test.test_os.TestInvalidFD.test_fchmod) ... ok
test_fchown (test.test_os.TestInvalidFD.test_fchown) ... ok
test_fdatasync (test.test_os.TestInvalidFD.test_fdatasync) ... ok
test_fdopen (test.test_os.TestInvalidFD.test_fdopen) ... ok
test_fpathconf (test.test_os.TestInvalidFD.test_fpathconf) ... ok
test_fstat (test.test_os.TestInvalidFD.test_fstat) ... ok
test_fstatvfs (test.test_os.TestInvalidFD.test_fstatvfs) ... ok
test_fsync (test.test_os.TestInvalidFD.test_fsync) ... ok
test_ftruncate (test.test_os.TestInvalidFD.test_ftruncate) ... ok
test_inheritable (test.test_os.TestInvalidFD.test_inheritable) ... ok
test_isatty (test.test_os.TestInvalidFD.test_isatty) ... ok
test_lseek (test.test_os.TestInvalidFD.test_lseek) ... ok
test_read (test.test_os.TestInvalidFD.test_read) ... ok
test_readv (test.test_os.TestInvalidFD.test_readv) ... ok
test_tcgetpgrp (test.test_os.TestInvalidFD.test_tcgetpgrp) ... ok
test_tcsetpgrpt (test.test_os.TestInvalidFD.test_tcsetpgrpt) ... ok
test_ttyname (test.test_os.TestInvalidFD.test_ttyname) ... ok
test_write (test.test_os.TestInvalidFD.test_write) ... ok
test_writev (test.test_os.TestInvalidFD.test_writev) ... ok
test_argument_required (test.test_os.TestPEP519.test_argument_required) ... ok
test_bad_pathlike (test.test_os.TestPEP519.test_bad_pathlike) ... ok
test_fsencode_fsdecode (test.test_os.TestPEP519.test_fsencode_fsdecode) ... ok
test_garbage_in_exception_out (test.test_os.TestPEP519.test_garbage_in_exception_out) ... ok
test_pathlike (test.test_os.TestPEP519.test_pathlike) ... ok
test_pathlike_class_getitem (test.test_os.TestPEP519.test_pathlike_class_getitem) ... ok
test_pathlike_subclasshook (test.test_os.TestPEP519.test_pathlike_subclasshook) ... ok
test_return_bytes (test.test_os.TestPEP519.test_return_bytes) ... ok
test_return_string (test.test_os.TestPEP519.test_return_string) ... ok
test_argument_required (test.test_os.TestPEP519PurePython.test_argument_required) ... ok
test_bad_pathlike (test.test_os.TestPEP519PurePython.test_bad_pathlike) ... ok
test_fsencode_fsdecode (test.test_os.TestPEP519PurePython.test_fsencode_fsdecode) ... ok
test_garbage_in_exception_out (test.test_os.TestPEP519PurePython.test_garbage_in_exception_out) ... ok
test_pathlike (test.test_os.TestPEP519PurePython.test_pathlike) ... ok
test_pathlike_class_getitem (test.test_os.TestPEP519PurePython.test_pathlike_class_getitem) ... ok
test_pathlike_subclasshook (test.test_os.TestPEP519PurePython.test_pathlike_subclasshook) ... ok
test_return_bytes (test.test_os.TestPEP519PurePython.test_return_bytes) ... ok
test_return_string (test.test_os.TestPEP519PurePython.test_return_string) ... ok
test_attributes (test.test_os.TestScandir.test_attributes) ... ok
test_bad_path_type (test.test_os.TestScandir.test_bad_path_type) ... ok
test_broken_symlink (test.test_os.TestScandir.test_broken_symlink) ... ok
test_bytes (test.test_os.TestScandir.test_bytes) ... ok
test_bytes_like (test.test_os.TestScandir.test_bytes_like) ... ok
test_close (test.test_os.TestScandir.test_close) ... ok
test_consume_iterator_twice (test.test_os.TestScandir.test_consume_iterator_twice) ... ok
test_context_manager (test.test_os.TestScandir.test_context_manager) ... ok
test_context_manager_close (test.test_os.TestScandir.test_context_manager_close) ... ok
test_context_manager_exception (test.test_os.TestScandir.test_context_manager_exception) ... ok
test_current_directory (test.test_os.TestScandir.test_current_directory) ... ok
test_empty_path (test.test_os.TestScandir.test_empty_path) ... ok
test_fd (test.test_os.TestScandir.test_fd) ... ok
test_fspath_protocol (test.test_os.TestScandir.test_fspath_protocol) ... ok
test_fspath_protocol_bytes (test.test_os.TestScandir.test_fspath_protocol_bytes) ... ok
test_removed_dir (test.test_os.TestScandir.test_removed_dir) ... ok
test_removed_file (test.test_os.TestScandir.test_removed_file) ... ok
test_repr (test.test_os.TestScandir.test_repr) ... ok
test_resource_warning (test.test_os.TestScandir.test_resource_warning) ... ok
test_uninstantiable (test.test_os.TestScandir.test_uninstantiable) ... ok
test_unpickable (test.test_os.TestScandir.test_unpickable) ... ok
test_flags (test.test_os.TestSendfile.test_flags) ... skipped 'requires headers and trailers support'
test_headers (test.test_os.TestSendfile.test_headers) ... skipped 'requires headers and trailers support'
test_headers_overflow_32bits (test.test_os.TestSendfile.test_headers_overflow_32bits) ... skipped 'requires headers and trailers support'
test_invalid_offset (test.test_os.TestSendfile.test_invalid_offset) ... ok
test_keywords (test.test_os.TestSendfile.test_keywords) ... ok
test_offset_overflow (test.test_os.TestSendfile.test_offset_overflow) ... ok
test_send_at_certain_offset (test.test_os.TestSendfile.test_send_at_certain_offset) ... ok
test_send_whole_file (test.test_os.TestSendfile.test_send_whole_file) ... ok
test_trailers (test.test_os.TestSendfile.test_trailers) ... skipped 'requires headers and trailers support'
test_trailers_overflow_32bits (test.test_os.TestSendfile.test_trailers_overflow_32bits) ... skipped 'requires headers and trailers support'
test_times (test.test_os.TimesTests.test_times) ... ok
test_urandom_failure (test.test_os.URandomFDTests.test_urandom_failure) ... ok
test_urandom_fd_closed (test.test_os.URandomFDTests.test_urandom_fd_closed) ... ok
test_urandom_fd_reopened (test.test_os.URandomFDTests.test_urandom_fd_reopened) ... ok
test_urandom_length (test.test_os.URandomTests.test_urandom_length) ... ok
test_urandom_subprocess (test.test_os.URandomTests.test_urandom_subprocess) ... ok
test_urandom_value (test.test_os.URandomTests.test_urandom_value) ... ok
test_issue31577 (test.test_os.UtimeTests.test_issue31577) ... skipped 'implementation detail specific to cpython'
test_large_time (test.test_os.UtimeTests.test_large_time) ... skipped 'requires NTFS'
test_utime (test.test_os.UtimeTests.test_utime) ... ok
test_utime_by_indexed (test.test_os.UtimeTests.test_utime_by_indexed) ... ok
test_utime_by_times (test.test_os.UtimeTests.test_utime_by_times) ... ok
test_utime_current (test.test_os.UtimeTests.test_utime_current) ... ok
test_utime_current_old (test.test_os.UtimeTests.test_utime_current_old) ... ok
test_utime_dir_fd (test.test_os.UtimeTests.test_utime_dir_fd) ... ok
test_utime_directory (test.test_os.UtimeTests.test_utime_directory) ... ok
test_utime_fd (test.test_os.UtimeTests.test_utime_fd) ... ok
test_utime_invalid_arguments (test.test_os.UtimeTests.test_utime_invalid_arguments) ... ok
test_utime_nofollow_symlinks (test.test_os.UtimeTests.test_utime_nofollow_symlinks) ... ok
test_file_like_path (test.test_os.WalkTests.test_file_like_path) ... ok
test_walk_bad_dir (test.test_os.WalkTests.test_walk_bad_dir) ... ok
test_walk_bad_dir2 (test.test_os.WalkTests.test_walk_bad_dir2) ... ok
test_walk_bottom_up (test.test_os.WalkTests.test_walk_bottom_up) ... ok
test_walk_many_open_files (test.test_os.WalkTests.test_walk_many_open_files) ... ok
test_walk_named_pipe (test.test_os.WalkTests.test_walk_named_pipe) ... ok
test_walk_named_pipe2 (test.test_os.WalkTests.test_walk_named_pipe2) ... ok
test_walk_prune (test.test_os.WalkTests.test_walk_prune) ... ok
test_walk_symlink (test.test_os.WalkTests.test_walk_symlink) ... ok
test_walk_topdown (test.test_os.WalkTests.test_walk_topdown) ... ok
test_chdir (test.test_os.Win32ErrorTests.test_chdir) ... skipped 'Win32 specific tests'
test_chmod (test.test_os.Win32ErrorTests.test_chmod) ... skipped 'Win32 specific tests'
test_mkdir (test.test_os.Win32ErrorTests.test_mkdir) ... skipped 'Win32 specific tests'
test_remove (test.test_os.Win32ErrorTests.test_remove) ... skipped 'Win32 specific tests'
test_rename (test.test_os.Win32ErrorTests.test_rename) ... skipped 'Win32 specific tests'
test_utime (test.test_os.Win32ErrorTests.test_utime) ... skipped 'Win32 specific tests'
test_create_junction (test.test_os.Win32JunctionTests.test_create_junction) ... skipped 'Win32 specific tests'
test_unlink_removes_junction (test.test_os.Win32JunctionTests.test_unlink_removes_junction) ... skipped 'Win32 specific tests'
test_CTRL_BREAK_EVENT (test.test_os.Win32KillTests.test_CTRL_BREAK_EVENT) ... skipped 'Win32 specific tests'
test_CTRL_C_EVENT (test.test_os.Win32KillTests.test_CTRL_C_EVENT) ... skipped 'Win32 specific tests'
test_kill_int (test.test_os.Win32KillTests.test_kill_int) ... skipped 'Win32 specific tests'
test_kill_sigterm (test.test_os.Win32KillTests.test_kill_sigterm) ... skipped 'Win32 specific tests'
test_listdir_extended_path (test.test_os.Win32ListdirTests.test_listdir_extended_path)
Test when the path starts with '\\?\'. ... skipped 'Win32 specific tests'
test_listdir_no_extended_path (test.test_os.Win32ListdirTests.test_listdir_no_extended_path)
Test when the path is not an "extended" path. ... skipped 'Win32 specific tests'
test_getfinalpathname_handles (test.test_os.Win32NtTests.test_getfinalpathname_handles) ... skipped 'Win32 specific tests'
test_stat_unlink_race (test.test_os.Win32NtTests.test_stat_unlink_race) ... skipped 'Win32 specific tests'
test_12084 (test.test_os.Win32SymlinkTests.test_12084) ... skipped 'Win32 specific tests'
test_29248 (test.test_os.Win32SymlinkTests.test_29248) ... skipped 'Win32 specific tests'
test_appexeclink (test.test_os.Win32SymlinkTests.test_appexeclink) ... skipped 'Win32 specific tests'
test_buffer_overflow (test.test_os.Win32SymlinkTests.test_buffer_overflow) ... skipped 'Win32 specific tests'
test_directory_link (test.test_os.Win32SymlinkTests.test_directory_link) ... skipped 'Win32 specific tests'
test_file_link (test.test_os.Win32SymlinkTests.test_file_link) ... skipped 'Win32 specific tests'
test_isdir_on_directory_link_to_missing_target (test.test_os.Win32SymlinkTests.test_isdir_on_directory_link_to_missing_target) ... skipped 'Win32 specific tests'
test_remove_directory_link_to_missing_target (test.test_os.Win32SymlinkTests.test_remove_directory_link_to_missing_target) ... skipped 'Win32 specific tests'
test_rmdir_on_directory_link_to_missing_target (test.test_os.Win32SymlinkTests.test_rmdir_on_directory_link_to_missing_target) ... skipped 'Win32 specific tests'
======================================================================
FAIL: test_fd_leak (test.test_os.FwalkTests.test_fd_leak)
----------------------------------------------------------------------
Traceback (most recent call last):
File "/buildbot/slave/pypy-c-jit-linux-x86-32/build/lib-python/3/test/test_os.py", line 1621, in test_fd_leak
self.assertEqual(newfd, minfd)
^^^^^^^^^^^
AssertionError: 12 != 15
----------------------------------------------------------------------
Ran 330 tests in 2.601s
FAILED (failures=1, skipped=67)
test_os failed (1 failure)
== Tests result: FAILURE ==
1 test failed:
test_os
Total duration: 2.8 sec
Total tests: run=330 failures=1 skipped=67
Total test files: run=1/1 failed=1
Result: FAILURE
test test_os failed
=========================== short test summary info ============================
SKIP [5] /buildbot/slave/pypy-c-jit-linux-x86-32/build/lib-python/conftest.py:606: implementation detail
SKIP [4] /buildbot/slave/pypy-c-jit-linux-x86-32/build/lib-python/conftest.py:606: CPython internal details
SKIP [1] /buildbot/slave/pypy-c-jit-linux-x86-32/build/lib-python/conftest.py:606: needs low level audio
SKIP [1] /buildbot/slave/pypy-c-jit-linux-x86-32/build/lib-python/conftest.py:606: needs ctypes.pythonapi
SKIP [3] /buildbot/slave/pypy-c-jit-linux-x86-32/build/lib-python/conftest.py:606: needs display
SKIP [1] /buildbot/slave/pypy-c-jit-linux-x86-32/build/lib-python/conftest.py:606: requires audio
SKIP [1] /buildbot/slave/pypy-c-jit-linux-x86-32/build/lib-python/conftest.py:606: demands too many resources
========================== slowest 10 test durations ===========================
360.75s call lib-python/3/test/test_smtpnet.py::unmodified
133.38s call lib-python/3/test/test_concurrent_futures::unmodified
132.16s call lib-python/3/test/test_asyncio::unmodified
112.19s call lib-python/3/test/test_regrtest.py::unmodified
100.99s call lib-python/3/test/test_multiprocessing_spawn::unmodified
99.06s call lib-python/3/test/test_hashlib.py::unmodified
82.40s call lib-python/3/test/test_multiprocessing_forkserver::unmodified
58.13s call lib-python/3/test/test_multiprocessing_fork::unmodified
40.98s call lib-python/3/test/test_subprocess.py::unmodified
39.96s call lib-python/3/test/test_socket.py::unmodified
============= 1 failed, 416 passed, 16 skipped in 1702.66 seconds ==============
program finished with exit code 1
elapsedTime=1703.274938