virt_test\Scripts\python.exe testrunner/runner.py --logfile=testrun.log --config=pypy/testrunner_cfg.py --config=~/machine_cfg.py --root=pypy --timeout=4000
in dir d:\pypy_stuff\buildbot64\slave\own-win-x86-64\build (timeout 4000 secs)
watching logfiles {'pytestLog': 'testrun.log'}
argv: ['virt_test\\Scripts\\python.exe', 'testrunner/runner.py', '--logfile=testrun.log', '--config=pypy/testrunner_cfg.py', '--config=~/machine_cfg.py', '--root=pypy', '--timeout=4000']
environment:
ALLUSERSPROFILE=C:\ProgramData
APPDATA=C:\Users\matti\AppData\Roaming
ASL.LOG=Destination=file
CHOCOLATEYINSTALL=C:\ProgramData\chocolatey
CHOCOLATEYLASTPATHUPDATE=133185086718935289
CHOCOLATEYTOOLSLOCATION=C:\tools
CLINK_DIR=C:\Program Files (x86)\clink\0.4.9
COMMONPROGRAMFILES=C:\Program Files (x86)\Common Files
COMMONPROGRAMFILES(X86)=C:\Program Files (x86)\Common Files
COMMONPROGRAMW6432=C:\Program Files\Common Files
COMPUTERNAME=DESKTOP-RYZEN
COMSPEC=C:\WINDOWS\system32\cmd.exe
CONDA_BAT=d:\miniconda\condabin\conda.bat
CONDA_EXE=d:\miniconda\Scripts\conda.exe
CONDA_SHLVL=0
CUDA_PATH=C:\Program Files\NVIDIA GPU Computing Toolkit\CUDA\v11.7
CUDA_PATH_V11_7=C:\Program Files\NVIDIA GPU Computing Toolkit\CUDA\v11.7
DRIVERDATA=C:\Windows\System32\Drivers\DriverData
LOCALAPPDATA=C:\Users\matti\AppData\Local
NUMBER_OF_PROCESSORS=2
NVTOOLSEXT_PATH=C:\Program Files\NVIDIA Corporation\NvToolsExt\
OS=Windows_NT
PATH=d:\CPython27\lib\site-packages\pywin32_system32;d:\pypy_stuff\pypy\externals\bin;D:\CPython27;D:\pypy_stuff\pypy2.7-v7.3.18\Scripts;D:\pypy_stuff\pypy2.7-v7.3.18;C:\Windows\system32;C:\Windows;C:\Windows\System32\Wbem;C:\Windows\System32\WindowsPowerShell\v1.0\;C:\Program Files\TortoiseHg\;C:\Program Files\Git\cmd;C:\ProgramData\chocolatey\bin;C:\WINDOWS\System32\OpenSSH
PATHEXT=.COM;.EXE;.BAT;.CMD;.VBS;.VBE;.JS;.JSE;.WSF;.WSH;.MSC
PROCESSOR_ARCHITECTURE=x86
PROCESSOR_ARCHITEW6432=AMD64
PROCESSOR_IDENTIFIER=AMD64 Family 23 Model 113 Stepping 0, AuthenticAMD
PROCESSOR_LEVEL=23
PROCESSOR_REVISION=7100
PROGRAMDATA=C:\ProgramData
PROGRAMFILES=C:\Program Files (x86)
PROGRAMFILES(X86)=C:\Program Files (x86)
PROGRAMW6432=C:\Program Files
PROMPT=$P$G
PSMODULEPATH=%ProgramFiles%\WindowsPowerShell\Modules;C:\WINDOWS\system32\WindowsPowerShell\v1.0\Modules
PUBLIC=C:\Users\Public
PWD=d:\pypy_stuff\buildbot64\slave\own-win-x86-64\build
PYPYCHERRYPICK=
PYPY_ENABLE_WINCONSOLEIO=1
PYTEST_XDIST_AUTO_NUM_WORKERS=4
PYTHONPATH=.;
RTOOLS40_HOME=C:\rtools40
RTOOLS43_HOME=C:\rtools43
RTOOLS44_HOME=C:\rtools44
SYSTEMDRIVE=C:
SYSTEMROOT=C:\WINDOWS
TEMP=D:\SystemTemp
TMP=D:\SystemTemp
TMPDIR=d:\systemtemp\pytest
USERDOMAIN=DESKTOP-RYZEN
USERNAME=matti
USERPROFILE=C:\Users\matti
VS140COMNTOOLS=C:\Program Files (x86)\Microsoft Visual Studio 14.0\Common7\Tools\
WINDIR=C:\WINDOWS
using PTY: False
using config pypy/testrunner_cfg.py
using config C:\Users\matti/machine_cfg.py
running 4 parallel test workers
setting MAKEFLAGS to ' ' (space)
-- config/test
-- interpreter/astcompiler/test
-- interpreter/pyparser/test
-- interpreter/test
-- module/__builtin__/test
-- module/__pypy__/test
-- module/_ast/test
-- module/_cffi_backend/test
-- module/_codecs/test
-- module/_continuation/test
-- module/_cppyy/test
-- module/_csv/test
-- module/_demo/test
-- module/_file/test
-- module/_io/test
-- module/_jitlog/test
-- module/_locale/test
-- module/_lsprof/test
-- module/_md5/test
-- module/_minimal_curses/test
-- module/_multibytecodec/test
-- module/_multiprocessing/test
-- module/_pypyjson/test
-- module/_random/test
-- module/_rawffi/alt/test
-- module/_rawffi/test
-- module/_sha/test
-- module/_socket/test
-- module/_sre/test
-- module/_vmprof/test
-- module/_warnings/test
-- module/_weakref/test
-- module/_winreg/test
-- module/array/test
-- module/binascii/test
-- module/bz2/test
-- module/cStringIO/test
-- module/cmath/test
-- module/cpyext/test/test_abstract.py
-- module/cpyext/test/test_api.py
-- module/cpyext/test/test_arraymodule.py
-- module/cpyext/test/test_boolobject.py
-- module/cpyext/test/test_borrow.py
-- module/cpyext/test/test_bufferobject.py
-- module/cpyext/test/test_bytearrayobject.py
-- module/cpyext/test/test_bytesobject.py
-- module/cpyext/test/test_capsule.py
-- module/cpyext/test/test_cell.py
-- module/cpyext/test/test_classobject.py
-- module/cpyext/test/test_codecs.py
-- module/cpyext/test/test_complexobject.py
-- module/cpyext/test/test_cpyext.py
-- module/cpyext/test/test_datetime.py
-- module/cpyext/test/test_dictobject.py
-- module/cpyext/test/test_eval.py
-- module/cpyext/test/test_fileobject.py
-- module/cpyext/test/test_floatobject.py
-- module/cpyext/test/test_frameobject.py
-- module/cpyext/test/test_funcobject.py
-- module/cpyext/test/test_genobject.py
-- module/cpyext/test/test_getargs.py
-- module/cpyext/test/test_import.py
-- module/cpyext/test/test_intobject.py
-- module/cpyext/test/test_iterator.py
-- module/cpyext/test/test_listobject.py
-- module/cpyext/test/test_longobject.py
-- module/cpyext/test/test_mapping.py
-- module/cpyext/test/test_marshal.py
-- module/cpyext/test/test_memoryobject.py
-- module/cpyext/test/test_methodobject.py
-- module/cpyext/test/test_misc.py
-- module/cpyext/test/test_module.py
-- module/cpyext/test/test_ndarrayobject.py
-- module/cpyext/test/test_number.py
-- module/cpyext/test/test_object.py
-- module/cpyext/test/test_pycobject.py
-- module/cpyext/test/test_pyerrors.py
-- module/cpyext/test/test_pyfile.py
-- module/cpyext/test/test_pysignals.py
-- module/cpyext/test/test_pystate.py
-- module/cpyext/test/test_pystrtod.py
-- module/cpyext/test/test_sequence.py
-- module/cpyext/test/test_setobject.py
-- module/cpyext/test/test_sliceobject.py
-- module/cpyext/test/test_structseq.py
-- module/cpyext/test/test_sysmodule.py
-- module/cpyext/test/test_thread.py
-- module/cpyext/test/test_traceback.py
-- module/cpyext/test/test_translate.py
-- module/cpyext/test/test_tupleobject.py
-- module/cpyext/test/test_typeobject.py
-- module/cpyext/test/test_unicodeobject.py
-- module/cpyext/test/test_userslots.py
-- module/cpyext/test/test_version.py
-- module/cpyext/test/test_weakref.py
-- module/crypt/test
-- module/errno/test
-- module/exceptions/test
-- module/faulthandler/test
-- module/fcntl/test
-- module/gc/test
-- module/imp/test
-- module/itertools/test
-- module/marshal/test
-- module/math/test
-- module/micronumpy/test
-- module/mmap/test
-- module/operator/test
-- module/parser/test
-- module/posix/test
-- module/pwd/test
-- module/pyexpat/test
-- module/pypyjit/test
-- module/select/test
-- module/signal/test
-- module/struct/test
-- module/sys/test
-- module/termios/test
-- module/test_lib_pypy
-- module/thread/test
-- module/time/test
-- module/unicodedata/test
-- module/zipimport/test
-- module/zlib/test
-- objspace/fake/test
-- objspace/std/test
-- objspace/test
-- sandbox/test
-- tool/bench/test
-- tool/memusage/test
-- tool/pytest/test
-- tool/release/test
-- tool/test
-- total: 133 to run
++ 03:18:26 starting config/test [1 started in total]
++ 03:18:26 starting interpreter/astcompiler/test [2 started in total]
++ 03:18:26 starting interpreter/pyparser/test [3 started in total]
++ 03:18:26 starting interpreter/test [4 started in total]
__ config/test [1 done in total, somefailed=False] ____________________________
============================= test session starts =============================
platform win32 -- Python 2.7.18[pypy-7.3.18-alpha], pytest-2.9.2, py-1.4.29, pluggy-0.3.1
hypothesis profile 'default' -> deadline=None, database=DirectoryBasedExampleDatabase('d:\\pypy_stuff\\buildbot64\\slave\\own-win-x86-64\\build\\pypy\\.hypothesis\\examples')
pytest-2.9.2 from d:\pypy_stuff\buildbot64\slave\own-win-x86-64\build\pytest.py
rootdir: d:\pypy_stuff\buildbot64\slave\own-win-x86-64\build, inifile: pytest.ini
plugins: hypothesis-4.39.3
collected 158 items / 1 skipped
config\test\test_pypyoption.py ..............................................................................................................................................................
=================== 158 passed, 1 skipped in 48.19 seconds ====================
++ 03:19:18 starting module/__builtin__/test [5 started in total]
__ interpreter/pyparser/test [2 done in total, somefailed=False] ______________
============================= test session starts =============================
platform win32 -- Python 2.7.18[pypy-7.3.18-alpha], pytest-2.9.2, py-1.4.29, pluggy-0.3.1
hypothesis profile 'default' -> deadline=None, database=DirectoryBasedExampleDatabase('d:\\pypy_stuff\\buildbot64\\slave\\own-win-x86-64\\build\\pypy\\.hypothesis\\examples')
pytest-2.9.2 from d:\pypy_stuff\buildbot64\slave\own-win-x86-64\build\pytest.pyc
rootdir: d:\pypy_stuff\buildbot64\slave\own-win-x86-64\build, inifile: pytest.ini
plugins: hypothesis-4.39.3
collected 119 items
interpreter\pyparser\test\test_automata.py ...
interpreter\pyparser\test\test_future.py .....................................
interpreter\pyparser\test\test_gendfa.py .
interpreter\pyparser\test\test_metaparser.py ...............
interpreter\pyparser\test\test_parser.py .............
interpreter\pyparser\test\test_parsestring.py .........
interpreter\pyparser\test\test_pyparse.py ....................................
interpreter\pyparser\test\test_pytokenizer.py .....
========================= 119 passed in 77.27 seconds =========================
++ 03:19:47 starting module/__pypy__/test [6 started in total]
__ interpreter/astcompiler/test [3 done in total, somefailed=False] ___________
============================= test session starts =============================
platform win32 -- Python 2.7.18[pypy-7.3.18-alpha], pytest-2.9.2, py-1.4.29, pluggy-0.3.1
hypothesis profile 'default' -> deadline=None, database=DirectoryBasedExampleDatabase('d:\\pypy_stuff\\buildbot64\\slave\\own-win-x86-64\\build\\pypy\\.hypothesis\\examples')
pytest-2.9.2 from d:\pypy_stuff\buildbot64\slave\own-win-x86-64\build\pytest.pyc
rootdir: d:\pypy_stuff\buildbot64\slave\own-win-x86-64\build, inifile: pytest.ini
plugins: hypothesis-4.39.3
[platform:msg] Updated environment with vsver 160, using x64 True
[platform:msg] Updated environment with vsver 160, using x64 True
collected 447 items
interpreter\astcompiler\test\apptest_misc.py .
interpreter\astcompiler\test\test_ast.py .......
interpreter\astcompiler\test\test_astbuilder.py .....................................................
interpreter\astcompiler\test\test_compiler.py ..........................................................................................................................................................................................................................................................................................................................................................................
interpreter\astcompiler\test\test_misc.py .
interpreter\astcompiler\test\test_symtable.py .......................
======================== 447 passed in 100.00 seconds =========================
++ 03:20:09 starting module/_ast/test [7 started in total]
__ module/__builtin__/test [4 done in total, somefailed=False] ________________
============================= test session starts =============================
platform win32 -- Python 2.7.18[pypy-7.3.18-alpha], pytest-2.9.2, py-1.4.29, pluggy-0.3.1
hypothesis profile 'default' -> deadline=None, database=DirectoryBasedExampleDatabase('d:\\pypy_stuff\\buildbot64\\slave\\own-win-x86-64\\build\\pypy\\.hypothesis\\examples')
pytest-2.9.2 from d:\pypy_stuff\buildbot64\slave\own-win-x86-64\build\pytest.pyc
rootdir: d:\pypy_stuff\buildbot64\slave\own-win-x86-64\build, inifile: pytest.ini
plugins: hypothesis-4.39.3
[platform:msg] Updated environment with vsver 160, using x64 True
[platform:msg] Updated environment with vsver 160, using x64 True
collected 305 items
module\__builtin__\test\apptest_compile.py ........
module\__builtin__\test\test_abstractinst.py ............
module\__builtin__\test\test_apply.py ...
module\__builtin__\test\test_builtin.py ..............................................s.....................
module\__builtin__\test\test_classobj.py ...........................................................
module\__builtin__\test\test_descriptor.py ..........................
module\__builtin__\test\test_filter.py ...........
module\__builtin__\test\test_functional.py .................................................
module\__builtin__\test\test_minmax.py ..........................
module\__builtin__\test\test_range.py ........................
module\__builtin__\test\test_rawinput.py ...
module\__builtin__\test\test_reduce.py ....
module\__builtin__\test\test_vars.py ...
module\__builtin__\test\test_zip.py .........
=================== 304 passed, 1 skipped in 52.50 seconds ====================
++ 03:20:18 starting module/_cffi_backend/test [8 started in total]
__ module/_ast/test [5 done in total, somefailed=False] _______________________
============================= test session starts =============================
platform win32 -- Python 2.7.18[pypy-7.3.18-alpha], pytest-2.9.2, py-1.4.29, pluggy-0.3.1
hypothesis profile 'default' -> deadline=None, database=DirectoryBasedExampleDatabase('d:\\pypy_stuff\\buildbot64\\slave\\own-win-x86-64\\build\\pypy\\.hypothesis\\examples')
pytest-2.9.2 from d:\pypy_stuff\buildbot64\slave\own-win-x86-64\build\pytest.pyc
rootdir: d:\pypy_stuff\buildbot64\slave\own-win-x86-64\build, inifile: pytest.ini
plugins: hypothesis-4.39.3
collected 36 items
module\_ast\test\test_ast.py ....................................
========================= 36 passed in 23.82 seconds ==========================
++ 03:20:38 starting module/_codecs/test [9 started in total]
__ module/__pypy__/test [6 done in total, somefailed=False] ___________________
============================= test session starts =============================
platform win32 -- Python 2.7.18[pypy-7.3.18-alpha], pytest-2.9.2, py-1.4.29, pluggy-0.3.1
hypothesis profile 'default' -> deadline=None, database=DirectoryBasedExampleDatabase('d:\\pypy_stuff\\buildbot64\\slave\\own-win-x86-64\\build\\pypy\\.hypothesis\\examples')
pytest-2.9.2 from d:\pypy_stuff\buildbot64\slave\own-win-x86-64\build\pytest.pyc
rootdir: d:\pypy_stuff\buildbot64\slave\own-win-x86-64\build, inifile: pytest.ini
plugins: hypothesis-4.39.3
collected 68 items
module\__pypy__\test\test_builders.py .....
module\__pypy__\test\test_bytebuffer.py ..
module\__pypy__\test\test_debug.py .......
module\__pypy__\test\test_identitydict.py ......
module\__pypy__\test\test_intop.py ...........
module\__pypy__\test\test_locals2fast.py .....
module\__pypy__\test\test_magic.py .......
module\__pypy__\test\test_newmemoryview.py ...
module\__pypy__\test\test_os.py .
module\__pypy__\test\test_signal.py ...ss
module\__pypy__\test\test_special.py ............s
module\__pypy__\test\test_time.py sss
==================== 62 passed, 6 skipped in 54.04 seconds ====================
++ 03:20:48 starting module/_continuation/test [10 started in total]
__ module/_codecs/test [7 done in total, somefailed=False] ____________________
============================= test session starts =============================
platform win32 -- Python 2.7.18[pypy-7.3.18-alpha], pytest-2.9.2, py-1.4.29, pluggy-0.3.1
hypothesis profile 'default' -> deadline=None, database=DirectoryBasedExampleDatabase('d:\\pypy_stuff\\buildbot64\\slave\\own-win-x86-64\\build\\pypy\\.hypothesis\\examples')
pytest-2.9.2 from d:\pypy_stuff\buildbot64\slave\own-win-x86-64\build\pytest.pyc
rootdir: d:\pypy_stuff\buildbot64\slave\own-win-x86-64\build, inifile: pytest.ini
plugins: hypothesis-4.39.3
collected 65 items
module\_codecs\test\test_codecs.py ................................................................
module\_codecs\test\test_ztranslation.py .
========================= 65 passed in 42.88 seconds ==========================
++ 03:21:23 starting module/_cppyy/test [11 started in total]
__ module/_cppyy/test [8 done in total, somefailed=False] _____________________
============================= test session starts =============================
platform win32 -- Python 2.7.18[pypy-7.3.18-alpha], pytest-2.9.2, py-1.4.29, pluggy-0.3.1
hypothesis profile 'default' -> deadline=None, database=DirectoryBasedExampleDatabase('d:\\pypy_stuff\\buildbot64\\slave\\own-win-x86-64\\build\\pypy\\.hypothesis\\examples')
pytest-2.9.2 from d:\pypy_stuff\buildbot64\slave\own-win-x86-64\build\pytest.pyc
rootdir: d:\pypy_stuff\buildbot64\slave\own-win-x86-64\build, inifile: pytest.ini
plugins: hypothesis-4.39.3
collected 0 items
======================== no tests ran in 0.01 seconds =========================
++ 03:21:29 starting module/_csv/test [12 started in total]
__ module/_continuation/test [9 done in total, somefailed=False] ______________
============================= test session starts =============================
platform win32 -- Python 2.7.18[pypy-7.3.18-alpha], pytest-2.9.2, py-1.4.29, pluggy-0.3.1
hypothesis profile 'default' -> deadline=None, database=DirectoryBasedExampleDatabase('d:\\pypy_stuff\\buildbot64\\slave\\own-win-x86-64\\build\\pypy\\.hypothesis\\examples')
pytest-2.9.2 from d:\pypy_stuff\buildbot64\slave\own-win-x86-64\build\pytest.pyc
rootdir: d:\pypy_stuff\buildbot64\slave\own-win-x86-64\build, inifile: pytest.ini
plugins: hypothesis-4.39.3
collected 81 items / 1 skipped
module\_continuation\test\test_generator.py ssss
module\_continuation\test\test_greenlet.py s.ssssss.sssssssssssssss.sss
module\_continuation\test\test_translated.py sssssssssssssssssssssssssssss
module\_continuation\test\test_zpickle.py ssssssssssssssssssss
==================== 3 passed, 79 skipped in 52.34 seconds ====================
++ 03:21:48 starting module/_demo/test [13 started in total]
__ module/_csv/test [10 done in total, somefailed=False] ______________________
============================= test session starts =============================
platform win32 -- Python 2.7.18[pypy-7.3.18-alpha], pytest-2.9.2, py-1.4.29, pluggy-0.3.1
hypothesis profile 'default' -> deadline=None, database=DirectoryBasedExampleDatabase('d:\\pypy_stuff\\buildbot64\\slave\\own-win-x86-64\\build\\pypy\\.hypothesis\\examples')
pytest-2.9.2 from d:\pypy_stuff\buildbot64\slave\own-win-x86-64\build\pytest.pyc
rootdir: d:\pypy_stuff\buildbot64\slave\own-win-x86-64\build, inifile: pytest.ini
plugins: hypothesis-4.39.3
collected 23 items
module\_csv\test\test_dialect.py .........
module\_csv\test\test_reader.py .........
module\_csv\test\test_writer.py ....
module\_csv\test\test_ztranslation.py .
========================= 23 passed in 28.98 seconds ==========================
++ 03:22:03 starting module/_file/test [14 started in total]
__ module/_demo/test [11 done in total, somefailed=False] _____________________
============================= test session starts =============================
platform win32 -- Python 2.7.18[pypy-7.3.18-alpha], pytest-2.9.2, py-1.4.29, pluggy-0.3.1
hypothesis profile 'default' -> deadline=None, database=DirectoryBasedExampleDatabase('d:\\pypy_stuff\\buildbot64\\slave\\own-win-x86-64\\build\\pypy\\.hypothesis\\examples')
pytest-2.9.2 from d:\pypy_stuff\buildbot64\slave\own-win-x86-64\build\pytest.pyc
rootdir: d:\pypy_stuff\buildbot64\slave\own-win-x86-64\build, inifile: pytest.ini
plugins: hypothesis-4.39.3
collected 3 items
module\_demo\test\test_import.py ..
module\_demo\test\test_sieve.py .
========================== 3 passed in 19.89 seconds ==========================
++ 03:22:12 starting module/_io/test [15 started in total]
__ module/_file/test [12 done in total, somefailed=False] _____________________
============================= test session starts =============================
platform win32 -- Python 2.7.18[pypy-7.3.18-alpha], pytest-2.9.2, py-1.4.29, pluggy-0.3.1
hypothesis profile 'default' -> deadline=None, database=DirectoryBasedExampleDatabase('d:\\pypy_stuff\\buildbot64\\slave\\own-win-x86-64\\build\\pypy\\.hypothesis\\examples')
pytest-2.9.2 from d:\pypy_stuff\buildbot64\slave\own-win-x86-64\build\pytest.pyc
rootdir: d:\pypy_stuff\buildbot64\slave\own-win-x86-64\build, inifile: pytest.ini
plugins: hypothesis-4.39.3
collected 269 items
module\_file\test\test_file.py .....................ss..sss......
module\_file\test\test_file_extra.py ..................................................................................................................................................................ss..............ss..............ss..............ss...........s......s.s
module\_file\test\test_large_file.py .s
=================== 252 passed, 17 skipped in 66.95 seconds ===================
++ 03:23:17 starting module/_jitlog/test [16 started in total]
__ module/_io/test [13 done in total, somefailed=False] _______________________
============================= test session starts =============================
platform win32 -- Python 2.7.18[pypy-7.3.18-alpha], pytest-2.9.2, py-1.4.29, pluggy-0.3.1
hypothesis profile 'default' -> deadline=None, database=DirectoryBasedExampleDatabase('d:\\pypy_stuff\\buildbot64\\slave\\own-win-x86-64\\build\\pypy\\.hypothesis\\examples')
pytest-2.9.2 from d:\pypy_stuff\buildbot64\slave\own-win-x86-64\build\pytest.pyc
rootdir: d:\pypy_stuff\buildbot64\slave\own-win-x86-64\build, inifile: pytest.ini
plugins: hypothesis-4.39.3
[platform:msg] Updated environment with vsver 160, using x64 True
[platform:msg] Updated environment with vsver 160, using x64 True
collected 200 items
module\_io\test\apptest_bytesio.py ............
module\_io\test\apptest_io.py ................................
module\_io\test\apptest_stringio.py .........................
module\_io\test\apptest_textio.py ...........................
module\_io\test\test_bufferedio.py ..............................................................................
module\_io\test\test_fileio.py ...............s......
module\_io\test\test_interp_textio.py ....
=================== 199 passed, 1 skipped in 80.54 seconds ====================
++ 03:23:34 starting module/_locale/test [17 started in total]
__ module/_jitlog/test [14 done in total, somefailed=False] ___________________
============================= test session starts =============================
platform win32 -- Python 2.7.18[pypy-7.3.18-alpha], pytest-2.9.2, py-1.4.29, pluggy-0.3.1
hypothesis profile 'default' -> deadline=None, database=DirectoryBasedExampleDatabase('d:\\pypy_stuff\\buildbot64\\slave\\own-win-x86-64\\build\\pypy\\.hypothesis\\examples')
pytest-2.9.2 from d:\pypy_stuff\buildbot64\slave\own-win-x86-64\build\pytest.pyc
rootdir: d:\pypy_stuff\buildbot64\slave\own-win-x86-64\build, inifile: pytest.ini
plugins: hypothesis-4.39.3
collected 1 items
module\_jitlog\test\test__jitlog.py s
========================= 1 skipped in 17.98 seconds ==========================
++ 03:23:38 starting module/_lsprof/test [18 started in total]
__ module/_locale/test [15 done in total, somefailed=False] ___________________
============================= test session starts =============================
platform win32 -- Python 2.7.18[pypy-7.3.18-alpha], pytest-2.9.2, py-1.4.29, pluggy-0.3.1
hypothesis profile 'default' -> deadline=None, database=DirectoryBasedExampleDatabase('d:\\pypy_stuff\\buildbot64\\slave\\own-win-x86-64\\build\\pypy\\.hypothesis\\examples')
pytest-2.9.2 from d:\pypy_stuff\buildbot64\slave\own-win-x86-64\build\pytest.pyc
rootdir: d:\pypy_stuff\buildbot64\slave\own-win-x86-64\build, inifile: pytest.ini
plugins: hypothesis-4.39.3
collected 14 items
module\_locale\test\test_locale.py .........ssss.
==================== 10 passed, 4 skipped in 23.42 seconds ====================
++ 03:23:59 starting module/_md5/test [19 started in total]
__ module/_lsprof/test [16 done in total, somefailed=False] ___________________
============================= test session starts =============================
platform win32 -- Python 2.7.18[pypy-7.3.18-alpha], pytest-2.9.2, py-1.4.29, pluggy-0.3.1
hypothesis profile 'default' -> deadline=None, database=DirectoryBasedExampleDatabase('d:\\pypy_stuff\\buildbot64\\slave\\own-win-x86-64\\build\\pypy\\.hypothesis\\examples')
pytest-2.9.2 from d:\pypy_stuff\buildbot64\slave\own-win-x86-64\build\pytest.pyc
rootdir: d:\pypy_stuff\buildbot64\slave\own-win-x86-64\build, inifile: pytest.ini
plugins: hypothesis-4.39.3
collected 6 items
module\_lsprof\test\test_cprofile.py ......
========================== 6 passed in 27.90 seconds ==========================
++ 03:24:12 starting module/_minimal_curses/test [20 started in total]
__ module/_md5/test [17 done in total, somefailed=False] ______________________
============================= test session starts =============================
platform win32 -- Python 2.7.18[pypy-7.3.18-alpha], pytest-2.9.2, py-1.4.29, pluggy-0.3.1
hypothesis profile 'default' -> deadline=None, database=DirectoryBasedExampleDatabase('d:\\pypy_stuff\\buildbot64\\slave\\own-win-x86-64\\build\\pypy\\.hypothesis\\examples')
pytest-2.9.2 from d:\pypy_stuff\buildbot64\slave\own-win-x86-64\build\pytest.pyc
rootdir: d:\pypy_stuff\buildbot64\slave\own-win-x86-64\build, inifile: pytest.ini
plugins: hypothesis-4.39.3
collected 6 items
module\_md5\test\test_md5.py .s....
==================== 5 passed, 1 skipped in 19.92 seconds =====================
++ 03:24:20 starting module/_multibytecodec/test [21 started in total]
__ module/_minimal_curses/test [18 done in total, somefailed=False] ___________
============================= test session starts =============================
platform win32 -- Python 2.7.18[pypy-7.3.18-alpha], pytest-2.9.2, py-1.4.29, pluggy-0.3.1
hypothesis profile 'default' -> deadline=None, database=DirectoryBasedExampleDatabase('d:\\pypy_stuff\\buildbot64\\slave\\own-win-x86-64\\build\\pypy\\.hypothesis\\examples')
pytest-2.9.2 from d:\pypy_stuff\buildbot64\slave\own-win-x86-64\build\pytest.pyc
rootdir: d:\pypy_stuff\buildbot64\slave\own-win-x86-64\build, inifile: pytest.ini
plugins: hypothesis-4.39.3
collected 6 items
[platform:msg] Updated environment with vsver 160, using x64 True
[platform:msg] Updated environment with vsver 160, using x64 True
module\_minimal_curses\test\test_curses.py ssssss
========================= 6 skipped in 19.59 seconds ==========================
++ 03:24:34 starting module/_multiprocessing/test [22 started in total]
__ module/_multibytecodec/test [19 done in total, somefailed=False] ___________
============================= test session starts =============================
platform win32 -- Python 2.7.18[pypy-7.3.18-alpha], pytest-2.9.2, py-1.4.29, pluggy-0.3.1
hypothesis profile 'default' -> deadline=None, database=DirectoryBasedExampleDatabase('d:\\pypy_stuff\\buildbot64\\slave\\own-win-x86-64\\build\\pypy\\.hypothesis\\examples')
pytest-2.9.2 from d:\pypy_stuff\buildbot64\slave\own-win-x86-64\build\pytest.pyc
rootdir: d:\pypy_stuff\buildbot64\slave\own-win-x86-64\build, inifile: pytest.ini
plugins: hypothesis-4.39.3
collected 51 items
module\_multibytecodec\test\test_app_codecs.py ................
module\_multibytecodec\test\test_app_incremental.py ............
module\_multibytecodec\test\test_app_stream.py .....
module\_multibytecodec\test\test_c_codecs.py ................s
module\_multibytecodec\test\test_translation.py .
==================== 50 passed, 1 skipped in 53.41 seconds ====================
++ 03:25:19 starting module/_pypyjson/test [23 started in total]
__ module/_pypyjson/test [20 done in total, somefailed=False] _________________
============================= test session starts =============================
platform win32 -- Python 2.7.18[pypy-7.3.18-alpha], pytest-2.9.2, py-1.4.29, pluggy-0.3.1
hypothesis profile 'default' -> deadline=None, database=DirectoryBasedExampleDatabase('d:\\pypy_stuff\\buildbot64\\slave\\own-win-x86-64\\build\\pypy\\.hypothesis\\examples')
pytest-2.9.2 from d:\pypy_stuff\buildbot64\slave\own-win-x86-64\build\pytest.pyc
rootdir: d:\pypy_stuff\buildbot64\slave\own-win-x86-64\build, inifile: pytest.ini
plugins: hypothesis-4.39.3
collected 45 items
module\_pypyjson\test\test__pypyjson.py ..........................................
module\_pypyjson\test\test_simd.py ...
========================= 45 passed in 21.33 seconds ==========================
++ 03:25:44 starting module/_random/test [24 started in total]
__ module/_random/test [21 done in total, somefailed=False] ___________________
============================= test session starts =============================
platform win32 -- Python 2.7.18[pypy-7.3.18-alpha], pytest-2.9.2, py-1.4.29, pluggy-0.3.1
hypothesis profile 'default' -> deadline=None, database=DirectoryBasedExampleDatabase('d:\\pypy_stuff\\buildbot64\\slave\\own-win-x86-64\\build\\pypy\\.hypothesis\\examples')
pytest-2.9.2 from d:\pypy_stuff\buildbot64\slave\own-win-x86-64\build\pytest.pyc
rootdir: d:\pypy_stuff\buildbot64\slave\own-win-x86-64\build, inifile: pytest.ini
plugins: hypothesis-4.39.3
collected 14 items
module\_random\test\test_random.py .............
module\_random\test\test_ztranslation.py .
========================= 14 passed in 37.79 seconds ==========================
++ 03:26:29 starting module/_rawffi/alt/test [25 started in total]
__ module/_multiprocessing/test [22 done in total, somefailed=False] __________
============================= test session starts =============================
platform win32 -- Python 2.7.18[pypy-7.3.18-alpha], pytest-2.9.2, py-1.4.29, pluggy-0.3.1
hypothesis profile 'default' -> deadline=None, database=DirectoryBasedExampleDatabase('d:\\pypy_stuff\\buildbot64\\slave\\own-win-x86-64\\build\\pypy\\.hypothesis\\examples')
pytest-2.9.2 from d:\pypy_stuff\buildbot64\slave\own-win-x86-64\build\pytest.pyc
rootdir: d:\pypy_stuff\buildbot64\slave\own-win-x86-64\build, inifile: pytest.ini
plugins: hypothesis-4.39.3
collected 24 items
module\_multiprocessing\test\test_connection.py ...........
module\_multiprocessing\test\test_interp_semaphore.py .
module\_multiprocessing\test\test_memory.py ..
module\_multiprocessing\test\test_semaphore.py .......
module\_multiprocessing\test\test_win32.py ..
module\_multiprocessing\test\test_ztranslation.py .
========================= 24 passed in 143.50 seconds =========================
++ 03:27:00 starting module/_rawffi/test [26 started in total]
__ module/_rawffi/alt/test [23 done in total, somefailed=False] _______________
============================= test session starts =============================
platform win32 -- Python 2.7.18[pypy-7.3.18-alpha], pytest-2.9.2, py-1.4.29, pluggy-0.3.1
hypothesis profile 'default' -> deadline=None, database=DirectoryBasedExampleDatabase('d:\\pypy_stuff\\buildbot64\\slave\\own-win-x86-64\\build\\pypy\\.hypothesis\\examples')
pytest-2.9.2 from d:\pypy_stuff\buildbot64\slave\own-win-x86-64\build\pytest.pyc
rootdir: d:\pypy_stuff\buildbot64\slave\own-win-x86-64\build, inifile: pytest.ini
plugins: hypothesis-4.39.3
collected 73 items
module\_rawffi\alt\test\test_ffitype.py .....
module\_rawffi\alt\test\test_funcptr.py ..s..............................ss.ss....
module\_rawffi\alt\test\test_struct.py ...............
module\_rawffi\alt\test\test_type_converter.py ...........
==================== 68 passed, 5 skipped in 55.88 seconds ====================
++ 03:27:29 starting module/_sha/test [27 started in total]
__ interpreter/test [24 done in total, somefailed=True] _______________________
============================= test session starts =============================
platform win32 -- Python 2.7.18[pypy-7.3.18-alpha], pytest-2.9.2, py-1.4.29, pluggy-0.3.1
hypothesis profile 'default' -> deadline=None, database=DirectoryBasedExampleDatabase('d:\\pypy_stuff\\buildbot64\\slave\\own-win-x86-64\\build\\pypy\\.hypothesis\\examples')
pytest-2.9.2 from d:\pypy_stuff\buildbot64\slave\own-win-x86-64\build\pytest.pyc
rootdir: d:\pypy_stuff\buildbot64\slave\own-win-x86-64\build, inifile: pytest.ini
plugins: hypothesis-4.39.3
[platform:msg] Updated environment with vsver 160, using x64 True
[platform:msg] Updated environment with vsver 160, using x64 True
collected 773 items
interpreter\test\apptest_class.py ...............
interpreter\test\apptest_exec.py ............................
interpreter\test\apptest_function.py ........................s..............................
interpreter\test\apptest_generator.py ..................................
interpreter\test\apptest_nestedscope.py .............
interpreter\test\apptest_pyframe.py .............................
interpreter\test\apptest_raise.py .....................
interpreter\test\test_app_main.py ....sssssssssssssssssssssssssssssssssss.............s......s......
interpreter\test\test_appinterp.py .............
interpreter\test\test_argument.py ...................................
interpreter\test\test_buffer.py ..
interpreter\test\test_cellfamily.py .......
interpreter\test\test_code.py ........
interpreter\test\test_compiler.py .........................................................................................................................
interpreter\test\test_descrtypecheck.py ..
interpreter\test\test_error.py ..........
interpreter\test\test_exceptcomp.py ...........
interpreter\test\test_exec.py .
interpreter\test\test_executioncontext.py ................
interpreter\test\test_extmodules.py .
interpreter\test\test_function.py ..........
interpreter\test\test_gateway.py ........................................ss............
interpreter\test\test_generator.py .
interpreter\test\test_interpreter.py ..........................
interpreter\test\test_main.py ....
interpreter\test\test_mixedmodule.py ......
interpreter\test\test_module.py ........
interpreter\test\test_objspace.py ..............................
interpreter\test\test_pycode.py .
interpreter\test\test_pyframe.py ..
interpreter\test\test_reverse_debugging.py ..
interpreter\test\test_special.py ..
interpreter\test\test_syntax.py ....................................................................
interpreter\test\test_targetpypy.py ..
interpreter\test\test_typedef.py ..................
interpreter\test\test_unicodehelper.py ..........
interpreter\test\test_zpy.py ....sF
interpreter\test\test_zzpickle_and_slow.py ...............s...................
================================== FAILURES ===================================
________________________________ test_pytrace _________________________________
def test_pytrace():
output = run(sys.executable, pypypath, '-S',
stdin="__pytrace__ = 1\nx = 5\nx")
assert ('\t<module>: LOAD_CONST 0 (5)\n'
'\t<module>: STORE_NAME 0 (x)\n'
'\t<module>: LOAD_CONST 1 (None)\n'
'\t<module>: RETURN_VALUE 0 \n'
'>>>> ') in output
assert ('\t<module>: LOAD_NAME 0 (x)\n'
'\t<module>: PRINT_EXPR 0 \n'
# '5\n' --- this line sent to stderr
'\t<module>: LOAD_CONST 0 (None)\n'
'\t<module>: RETURN_VALUE 0 \n'
> '>>>> ') in output
E assert '\t<module>: LOAD_NAME 0 (x)\n\t<module>: PRINT_EXPR 0 \n\t<module>: LOAD_CONST 0 (None)\n\t<module>: RETURN_VALUE 0 \n>>>> ' in '>>>> Tracing enabled\n>>>> \t<module>: LOAD_CONST 0 (5)\n\t<module>: STORE_NAME 0 (x)\n\t<m... PRINT_EXPR 0 5\n\n\t<module>: LOAD_CONST 0 (None)\n\t<module>: RETURN_VALUE 0 \n>>>> '
interpreter\test\test_zpy.py:121: AssertionError
---------------------------- Captured stderr call -----------------------------
[platform:msg] Updated environment with vsver 160, using x64 True
[platform:msg] Updated environment with vsver 160, using x64 True
PyPy 8.0.0-alpha0 in StdObjSpace on top of Python 2.7.18 (startuptime: 10.67 secs)
=========================== short test summary info ===========================
FAIL interpreter\test\test_zpy.py::test_pytrace
============= 1 failed, 730 passed, 42 skipped in 537.91 seconds ==============
++ 03:27:31 starting module/_socket/test [28 started in total]
__ module/_sha/test [25 done in total, somefailed=False] ______________________
============================= test session starts =============================
platform win32 -- Python 2.7.18[pypy-7.3.18-alpha], pytest-2.9.2, py-1.4.29, pluggy-0.3.1
hypothesis profile 'default' -> deadline=None, database=DirectoryBasedExampleDatabase('d:\\pypy_stuff\\buildbot64\\slave\\own-win-x86-64\\build\\pypy\\.hypothesis\\examples')
pytest-2.9.2 from d:\pypy_stuff\buildbot64\slave\own-win-x86-64\build\pytest.pyc
rootdir: d:\pypy_stuff\buildbot64\slave\own-win-x86-64\build, inifile: pytest.ini
plugins: hypothesis-4.39.3
collected 6 items
module\_sha\test\test_sha.py .s....
==================== 5 passed, 1 skipped in 32.28 seconds =====================
++ 03:28:03 starting module/_sre/test [29 started in total]
__ module/_rawffi/test [26 done in total, somefailed=False] ___________________
============================= test session starts =============================
platform win32 -- Python 2.7.18[pypy-7.3.18-alpha], pytest-2.9.2, py-1.4.29, pluggy-0.3.1
hypothesis profile 'default' -> deadline=None, database=DirectoryBasedExampleDatabase('d:\\pypy_stuff\\buildbot64\\slave\\own-win-x86-64\\build\\pypy\\.hypothesis\\examples')
pytest-2.9.2 from d:\pypy_stuff\buildbot64\slave\own-win-x86-64\build\pytest.pyc
rootdir: d:\pypy_stuff\buildbot64\slave\own-win-x86-64\build, inifile: pytest.ini
plugins: hypothesis-4.39.3
[platform:msg] Updated environment with vsver 160, using x64 True
[platform:msg] Updated environment with vsver 160, using x64 True
collected 83 items
module\_rawffi\test\apptest_rawffi.py .
module\_rawffi\test\test__rawffi.py .................s.................................s................
module\_rawffi\test\test_exit.py s
module\_rawffi\test\test_nested.py ......
module\_rawffi\test\test_struct.py ...
module\_rawffi\test\test_tracker.py ...
module\_rawffi\test\test_ztranslation.py .
==================== 80 passed, 3 skipped in 76.42 seconds ====================
n: 2
Arg 0: 3
Arg 1: 15
++ 03:28:22 starting module/_vmprof/test [30 started in total]
__ module/_vmprof/test [27 done in total, somefailed=False] ___________________
============================= test session starts =============================
platform win32 -- Python 2.7.18[pypy-7.3.18-alpha], pytest-2.9.2, py-1.4.29, pluggy-0.3.1
hypothesis profile 'default' -> deadline=None, database=DirectoryBasedExampleDatabase('d:\\pypy_stuff\\buildbot64\\slave\\own-win-x86-64\\build\\pypy\\.hypothesis\\examples')
pytest-2.9.2 from d:\pypy_stuff\buildbot64\slave\own-win-x86-64\build\pytest.pyc
rootdir: d:\pypy_stuff\buildbot64\slave\own-win-x86-64\build, inifile: pytest.ini
plugins: hypothesis-4.39.3
collected 0 items
======================== no tests ran in 0.00 seconds =========================
++ 03:28:25 starting module/_warnings/test [31 started in total]
__ module/_sre/test [28 done in total, somefailed=False] ______________________
============================= test session starts =============================
platform win32 -- Python 2.7.18[pypy-7.3.18-alpha], pytest-2.9.2, py-1.4.29, pluggy-0.3.1
hypothesis profile 'default' -> deadline=None, database=DirectoryBasedExampleDatabase('d:\\pypy_stuff\\buildbot64\\slave\\own-win-x86-64\\build\\pypy\\.hypothesis\\examples')
pytest-2.9.2 from d:\pypy_stuff\buildbot64\slave\own-win-x86-64\build\pytest.pyc
rootdir: d:\pypy_stuff\buildbot64\slave\own-win-x86-64\build, inifile: pytest.ini
plugins: hypothesis-4.39.3
collected 139 items
module\_sre\test\test_app_sre.py ...................................................................................................................
module\_sre\test\test_sre_buf.py ........................
========================= 139 passed in 37.11 seconds =========================
++ 03:28:43 starting module/_weakref/test [32 started in total]
__ module/_cffi_backend/test [29 done in total, somefailed=False] _____________
[platform:msg] Updated environment with vsver 160, using x64 True
============================= test session starts =============================
platform win32 -- Python 2.7.18[pypy-7.3.18-alpha], pytest-2.9.2, py-1.4.29, pluggy-0.3.1
hypothesis profile 'default' -> deadline=None, database=DirectoryBasedExampleDatabase('d:\\pypy_stuff\\buildbot64\\slave\\own-win-x86-64\\build\\pypy\\.hypothesis\\examples')
pytest-2.9.2 from d:\pypy_stuff\buildbot64\slave\own-win-x86-64\build\pytest.pyc
rootdir: d:\pypy_stuff\buildbot64\slave\own-win-x86-64\build, inifile: pytest.ini
plugins: hypothesis-4.39.3
collected 466 items
module\_cffi_backend\test\test_c.py s..............................................................................ssss.s....................................................s.....s...................sss...........................s...s........................s......
module\_cffi_backend\test\test_fastpath.py ..................
module\_cffi_backend\test\test_ffi_obj.py .............................................
module\_cffi_backend\test\test_file.py s..
module\_cffi_backend\test\test_parse_c_type.py ..............s...
module\_cffi_backend\test\test_re_python.py .................s..
module\_cffi_backend\test\test_recompiler.py .............................s...........................................................s..s............ssss..s.s.ss.......
module\_cffi_backend\test\test_unicode_literals.py .......
module\_cffi_backend\test\test_wchar_helper.py .
module\_cffi_backend\test\test_ztranslation.py s
================== 437 passed, 29 skipped in 511.47 seconds ===================
++ 03:28:55 starting module/_winreg/test [33 started in total]
__ module/_warnings/test [30 done in total, somefailed=False] _________________
============================= test session starts =============================
platform win32 -- Python 2.7.18[pypy-7.3.18-alpha], pytest-2.9.2, py-1.4.29, pluggy-0.3.1
hypothesis profile 'default' -> deadline=None, database=DirectoryBasedExampleDatabase('d:\\pypy_stuff\\buildbot64\\slave\\own-win-x86-64\\build\\pypy\\.hypothesis\\examples')
pytest-2.9.2 from d:\pypy_stuff\buildbot64\slave\own-win-x86-64\build\pytest.pyc
rootdir: d:\pypy_stuff\buildbot64\slave\own-win-x86-64\build, inifile: pytest.ini
plugins: hypothesis-4.39.3
[platform:msg] Updated environment with vsver 160, using x64 True
[platform:msg] Updated environment with vsver 160, using x64 True
collected 12 items
module\_warnings\test\apptest_warnings.py ...........
module\_warnings\test\test_warnings.py .
========================= 12 passed in 40.85 seconds ==========================
++ 03:29:11 starting module/array/test [34 started in total]
__ module/_weakref/test [31 done in total, somefailed=False] __________________
============================= test session starts =============================
platform win32 -- Python 2.7.18[pypy-7.3.18-alpha], pytest-2.9.2, py-1.4.29, pluggy-0.3.1
hypothesis profile 'default' -> deadline=None, database=DirectoryBasedExampleDatabase('d:\\pypy_stuff\\buildbot64\\slave\\own-win-x86-64\\build\\pypy\\.hypothesis\\examples')
pytest-2.9.2 from d:\pypy_stuff\buildbot64\slave\own-win-x86-64\build\pytest.pyc
rootdir: d:\pypy_stuff\buildbot64\slave\own-win-x86-64\build, inifile: pytest.ini
plugins: hypothesis-4.39.3
collected 42 items
module\_weakref\test\test_weakref.py ....................s.....................
==================== 41 passed, 1 skipped in 26.76 seconds ====================
++ 03:29:12 starting module/binascii/test [35 started in total]
__ module/_winreg/test [32 done in total, somefailed=False] ___________________
============================= test session starts =============================
platform win32 -- Python 2.7.18[pypy-7.3.18-alpha], pytest-2.9.2, py-1.4.29, pluggy-0.3.1
hypothesis profile 'default' -> deadline=None, database=DirectoryBasedExampleDatabase('d:\\pypy_stuff\\buildbot64\\slave\\own-win-x86-64\\build\\pypy\\.hypothesis\\examples')
pytest-2.9.2 from d:\pypy_stuff\buildbot64\slave\own-win-x86-64\build\pytest.pyc
rootdir: d:\pypy_stuff\buildbot64\slave\own-win-x86-64\build, inifile: pytest.ini
plugins: hypothesis-4.39.3
collected 18 items
module\_winreg\test\test_winreg.py ............s..ss.
==================== 15 passed, 3 skipped in 27.23 seconds ====================
++ 03:29:24 starting module/bz2/test [36 started in total]
__ module/_socket/test [33 done in total, somefailed=False] ___________________
============================= test session starts =============================
platform win32 -- Python 2.7.18[pypy-7.3.18-alpha], pytest-2.9.2, py-1.4.29, pluggy-0.3.1
hypothesis profile 'default' -> deadline=None, database=DirectoryBasedExampleDatabase('d:\\pypy_stuff\\buildbot64\\slave\\own-win-x86-64\\build\\pypy\\.hypothesis\\examples')
pytest-2.9.2 from d:\pypy_stuff\buildbot64\slave\own-win-x86-64\build\pytest.pyc
rootdir: d:\pypy_stuff\buildbot64\slave\own-win-x86-64\build, inifile: pytest.ini
plugins: hypothesis-4.39.3
collected 60 items
module\_socket\test\test_sock_app.py .......s..........s.............s...........s.s.ss.........
module\_socket\test\test_ztranslation.py .
=================== 53 passed, 7 skipped in 116.21 seconds ====================
++ 03:29:29 starting module/cStringIO/test [37 started in total]
__ module/bz2/test [34 done in total, somefailed=False] _______________________
============================= test session starts =============================
platform win32 -- Python 2.7.18[pypy-7.3.18-alpha], pytest-2.9.2, py-1.4.29, pluggy-0.3.1
hypothesis profile 'default' -> deadline=None, database=DirectoryBasedExampleDatabase('d:\\pypy_stuff\\buildbot64\\slave\\own-win-x86-64\\build\\pypy\\.hypothesis\\examples')
pytest-2.9.2 from d:\pypy_stuff\buildbot64\slave\own-win-x86-64\build\pytest.pyc
rootdir: d:\pypy_stuff\buildbot64\slave\own-win-x86-64\build, inifile: pytest.ini
plugins: hypothesis-4.39.3
collected 1 items / 2 skipped
module\bz2\test\test_large.py s
========================= 3 skipped in 13.72 seconds ==========================
++ 03:29:39 starting module/cmath/test [38 started in total]
__ module/binascii/test [35 done in total, somefailed=False] __________________
============================= test session starts =============================
platform win32 -- Python 2.7.18[pypy-7.3.18-alpha], pytest-2.9.2, py-1.4.29, pluggy-0.3.1
hypothesis profile 'default' -> deadline=None, database=DirectoryBasedExampleDatabase('d:\\pypy_stuff\\buildbot64\\slave\\own-win-x86-64\\build\\pypy\\.hypothesis\\examples')
pytest-2.9.2 from d:\pypy_stuff\buildbot64\slave\own-win-x86-64\build\pytest.pyc
rootdir: d:\pypy_stuff\buildbot64\slave\own-win-x86-64\build, inifile: pytest.ini
plugins: hypothesis-4.39.3
collected 14 items
module\binascii\test\test_binascii.py ..............
========================= 14 passed in 25.06 seconds ==========================
++ 03:29:40 starting module/cpyext/test/test_abstract.py [39 started in total]
__ module/cStringIO/test [36 done in total, somefailed=False] _________________
============================= test session starts =============================
platform win32 -- Python 2.7.18[pypy-7.3.18-alpha], pytest-2.9.2, py-1.4.29, pluggy-0.3.1
hypothesis profile 'default' -> deadline=None, database=DirectoryBasedExampleDatabase('d:\\pypy_stuff\\buildbot64\\slave\\own-win-x86-64\\build\\pypy\\.hypothesis\\examples')
pytest-2.9.2 from d:\pypy_stuff\buildbot64\slave\own-win-x86-64\build\pytest.pyc
rootdir: d:\pypy_stuff\buildbot64\slave\own-win-x86-64\build, inifile: pytest.ini
plugins: hypothesis-4.39.3
collected 16 items
module\cStringIO\test\test_interp_stringio.py ...............
module\cStringIO\test\test_ztranslation.py .
========================= 16 passed in 22.19 seconds ==========================
++ 03:29:54 starting module/cpyext/test/test_api.py [40 started in total]
__ module/cmath/test [37 done in total, somefailed=False] _____________________
============================= test session starts =============================
platform win32 -- Python 2.7.18[pypy-7.3.18-alpha], pytest-2.9.2, py-1.4.29, pluggy-0.3.1
hypothesis profile 'default' -> deadline=None, database=DirectoryBasedExampleDatabase('d:\\pypy_stuff\\buildbot64\\slave\\own-win-x86-64\\build\\pypy\\.hypothesis\\examples')
pytest-2.9.2 from d:\pypy_stuff\buildbot64\slave\own-win-x86-64\build\pytest.pyc
rootdir: d:\pypy_stuff\buildbot64\slave\own-win-x86-64\build, inifile: pytest.ini
plugins: hypothesis-4.39.3
collected 15 items
module\cmath\test\test_cmath.py ...............
========================= 15 passed in 26.13 seconds ==========================
++ 03:30:08 starting module/cpyext/test/test_arraymodule.py [41 started in total]
__ module/array/test [38 done in total, somefailed=False] _____________________
============================= test session starts =============================
platform win32 -- Python 2.7.18[pypy-7.3.18-alpha], pytest-2.9.2, py-1.4.29, pluggy-0.3.1
hypothesis profile 'default' -> deadline=None, database=DirectoryBasedExampleDatabase('d:\\pypy_stuff\\buildbot64\\slave\\own-win-x86-64\\build\\pypy\\.hypothesis\\examples')
pytest-2.9.2 from d:\pypy_stuff\buildbot64\slave\own-win-x86-64\build\pytest.pyc
rootdir: d:\pypy_stuff\buildbot64\slave\own-win-x86-64\build, inifile: pytest.ini
plugins: hypothesis-4.39.3
collected 49 items
module\array\test\test_array.py ....................................s...........
module\array\test\test_ztranslation.py .
==================== 48 passed, 1 skipped in 72.69 seconds ====================
++ 03:30:25 starting module/cpyext/test/test_boolobject.py [42 started in total]
__ module/cpyext/test/test_api.py [39 done in total, somefailed=False] ________
============================= test session starts =============================
platform win32 -- Python 2.7.18[pypy-7.3.18-alpha], pytest-2.9.2, py-1.4.29, pluggy-0.3.1
hypothesis profile 'default' -> deadline=None, database=DirectoryBasedExampleDatabase('d:\\pypy_stuff\\buildbot64\\slave\\own-win-x86-64\\build\\pypy\\.hypothesis\\examples')
pytest-2.9.2 from d:\pypy_stuff\buildbot64\slave\own-win-x86-64\build\pytest.pyc
rootdir: d:\pypy_stuff\buildbot64\slave\own-win-x86-64\build, inifile: pytest.ini
plugins: hypothesis-4.39.3
collected 0 items / 1 skipped
========================== 1 skipped in 0.02 seconds ==========================
++ 03:30:27 starting module/cpyext/test/test_borrow.py [43 started in total]
__ module/cpyext/test/test_arraymodule.py [40 done in total, somefailed=False]
============================= test session starts =============================
platform win32 -- Python 2.7.18[pypy-7.3.18-alpha], pytest-2.9.2, py-1.4.29, pluggy-0.3.1
hypothesis profile 'default' -> deadline=None, database=DirectoryBasedExampleDatabase('d:\\pypy_stuff\\buildbot64\\slave\\own-win-x86-64\\build\\pypy\\.hypothesis\\examples')
pytest-2.9.2 from d:\pypy_stuff\buildbot64\slave\own-win-x86-64\build\pytest.pyc
rootdir: d:\pypy_stuff\buildbot64\slave\own-win-x86-64\build, inifile: pytest.ini
plugins: hypothesis-4.39.3
collected 0 items / 1 skipped
========================== 1 skipped in 0.02 seconds ==========================
++ 03:30:29 starting module/cpyext/test/test_bufferobject.py [44 started in total]
__ module/cpyext/test/test_abstract.py [41 done in total, somefailed=False] ___
============================= test session starts =============================
platform win32 -- Python 2.7.18[pypy-7.3.18-alpha], pytest-2.9.2, py-1.4.29, pluggy-0.3.1
hypothesis profile 'default' -> deadline=None, database=DirectoryBasedExampleDatabase('d:\\pypy_stuff\\buildbot64\\slave\\own-win-x86-64\\build\\pypy\\.hypothesis\\examples')
pytest-2.9.2 from d:\pypy_stuff\buildbot64\slave\own-win-x86-64\build\pytest.pyc
rootdir: d:\pypy_stuff\buildbot64\slave\own-win-x86-64\build, inifile: pytest.ini
plugins: hypothesis-4.39.3
collected 0 items / 1 skipped
========================== 1 skipped in 0.02 seconds ==========================
++ 03:30:33 starting module/cpyext/test/test_bytearrayobject.py [45 started in total]
__ module/cpyext/test/test_borrow.py [42 done in total, somefailed=True] ______
INTERNALERROR> Traceback (most recent call last):
INTERNALERROR> File "d:\pypy_stuff\buildbot64\slave\own-win-x86-64\build\_pytest\main.py", line 90, in wrap_session
INTERNALERROR> config._do_configure()
INTERNALERROR> File "d:\pypy_stuff\buildbot64\slave\own-win-x86-64\build\_pytest\config.py", line 839, in _do_configure
INTERNALERROR> self.hook.pytest_configure.call_historic(kwargs=dict(config=self))
INTERNALERROR> File "d:\pypy_stuff\buildbot64\slave\own-win-x86-64\build\_pytest\vendored_packages\pluggy.py", line 729, in call_historic
INTERNALERROR> self._hookexec(self, self._nonwrappers + self._wrappers, kwargs)
INTERNALERROR> File "d:\pypy_stuff\buildbot64\slave\own-win-x86-64\build\_pytest\vendored_packages\pluggy.py", line 338, in _hookexec
INTERNALERROR> return self._inner_hookexec(hook, methods, kwargs)
INTERNALERROR> File "d:\pypy_stuff\buildbot64\slave\own-win-x86-64\build\_pytest\vendored_packages\pluggy.py", line 333, in <lambda>
INTERNALERROR> _MultiCall(methods, kwargs, hook.spec_opts).execute()
INTERNALERROR> File "d:\pypy_stuff\buildbot64\slave\own-win-x86-64\build\_pytest\vendored_packages\pluggy.py", line 596, in execute
INTERNALERROR> res = hook_impl.function(*args)
INTERNALERROR> File "d:\pypy_stuff\buildbot64\slave\own-win-x86-64\build\pypy\module\cpyext\test\conftest.py", line 41, in pytest_configure
INTERNALERROR> import pypy.module.cpyext.test.test_cpyext
INTERNALERROR> File "d:\pypy_stuff\buildbot64\slave\own-win-x86-64\build\pypy\module\cpyext\test\test_cpyext.py", line 9, in <module>
INTERNALERROR> from pypy.module.cpyext import api
INTERNALERROR> File "d:\pypy_stuff\buildbot64\slave\own-win-x86-64\build\pypy\module\cpyext\api.py", line 153, in <module>
INTERNALERROR> globals().update(rffi_platform.configure(CConfig_constants))
INTERNALERROR> File "d:\pypy_stuff\buildbot64\slave\own-win-x86-64\build\rpython\rtyper\tool\rffi_platform.py", line 216, in configure
INTERNALERROR> for name, result in zip(entries, results):
INTERNALERROR> File "d:\pypy_stuff\buildbot64\slave\own-win-x86-64\build\rpython\rtyper\tool\rffi_platform.py", line 241, in configure_entries
INTERNALERROR> writer.path, eci, ignore_errors=ignore_errors))
INTERNALERROR> File "d:\pypy_stuff\buildbot64\slave\own-win-x86-64\build\rpython\rtyper\tool\rffi_platform.py", line 745, in run_example_code
INTERNALERROR> output = build_executable_cache(files, eci, ignore_errors=ignore_errors)
INTERNALERROR> File "d:\pypy_stuff\buildbot64\slave\own-win-x86-64\build\rpython\tool\gcc_cache.py", line 28, in build_executable_cache
INTERNALERROR> result = platform.execute(platform.compile(c_files, eci))
INTERNALERROR> File "d:\pypy_stuff\buildbot64\slave\own-win-x86-64\build\rpython\translator\platform\__init__.py", line 57, in compile
INTERNALERROR> ofiles = self._compile_o_files(cfiles, eci, standalone)
INTERNALERROR> File "d:\pypy_stuff\buildbot64\slave\own-win-x86-64\build\rpython\translator\platform\__init__.py", line 79, in _compile_o_files
INTERNALERROR> ofiles.append(self._compile_c_file(self.cc, cfile, compile_args))
INTERNALERROR> File "d:\pypy_stuff\buildbot64\slave\own-win-x86-64\build\rpython\translator\platform\windows.py", line 290, in _compile_c_file
INTERNALERROR> self._execute_c_compiler(cc, args, oname)
INTERNALERROR> File "d:\pypy_stuff\buildbot64\slave\own-win-x86-64\build\rpython\translator\platform\__init__.py", line 143, in _execute_c_compiler
INTERNALERROR> self._handle_error(returncode, stdout, stderr, outname)
INTERNALERROR> File "d:\pypy_stuff\buildbot64\slave\own-win-x86-64\build\rpython\translator\platform\windows.py", line 319, in _handle_error
INTERNALERROR> raise CompilationError(stdout, stderr)
INTERNALERROR> CompilationError: CompilationError(out="""
INTERNALERROR> """)
++ 03:30:45 starting module/cpyext/test/test_bytesobject.py [46 started in total]
__ module/cpyext/test/test_boolobject.py [43 done in total, somefailed=False] _
============================= test session starts =============================
platform win32 -- Python 2.7.18[pypy-7.3.18-alpha], pytest-2.9.2, py-1.4.29, pluggy-0.3.1
hypothesis profile 'default' -> deadline=None, database=DirectoryBasedExampleDatabase('d:\\pypy_stuff\\buildbot64\\slave\\own-win-x86-64\\build\\pypy\\.hypothesis\\examples')
pytest-2.9.2 from d:\pypy_stuff\buildbot64\slave\own-win-x86-64\build\pytest.pyc
rootdir: d:\pypy_stuff\buildbot64\slave\own-win-x86-64\build, inifile: pytest.ini
plugins: hypothesis-4.39.3
collected 0 items / 1 skipped
========================== 1 skipped in 0.02 seconds ==========================
++ 03:30:46 starting module/cpyext/test/test_capsule.py [47 started in total]
__ module/cpyext/test/test_bufferobject.py [44 done in total, somefailed=False]
============================= test session starts =============================
platform win32 -- Python 2.7.18[pypy-7.3.18-alpha], pytest-2.9.2, py-1.4.29, pluggy-0.3.1
hypothesis profile 'default' -> deadline=None, database=DirectoryBasedExampleDatabase('d:\\pypy_stuff\\buildbot64\\slave\\own-win-x86-64\\build\\pypy\\.hypothesis\\examples')
pytest-2.9.2 from d:\pypy_stuff\buildbot64\slave\own-win-x86-64\build\pytest.pyc
rootdir: d:\pypy_stuff\buildbot64\slave\own-win-x86-64\build, inifile: pytest.ini
plugins: hypothesis-4.39.3
collected 0 items / 1 skipped
========================== 1 skipped in 0.01 seconds ==========================
++ 03:30:50 starting module/cpyext/test/test_cell.py [48 started in total]
__ module/cpyext/test/test_bytearrayobject.py [45 done in total, somefailed=False]
============================= test session starts =============================
platform win32 -- Python 2.7.18[pypy-7.3.18-alpha], pytest-2.9.2, py-1.4.29, pluggy-0.3.1
hypothesis profile 'default' -> deadline=None, database=DirectoryBasedExampleDatabase('d:\\pypy_stuff\\buildbot64\\slave\\own-win-x86-64\\build\\pypy\\.hypothesis\\examples')
pytest-2.9.2 from d:\pypy_stuff\buildbot64\slave\own-win-x86-64\build\pytest.pyc
rootdir: d:\pypy_stuff\buildbot64\slave\own-win-x86-64\build, inifile: pytest.ini
plugins: hypothesis-4.39.3
collected 0 items / 1 skipped
========================== 1 skipped in 0.02 seconds ==========================
++ 03:30:54 starting module/cpyext/test/test_classobject.py [49 started in total]
__ module/cpyext/test/test_capsule.py [46 done in total, somefailed=False] ____
============================= test session starts =============================
platform win32 -- Python 2.7.18[pypy-7.3.18-alpha], pytest-2.9.2, py-1.4.29, pluggy-0.3.1
hypothesis profile 'default' -> deadline=None, database=DirectoryBasedExampleDatabase('d:\\pypy_stuff\\buildbot64\\slave\\own-win-x86-64\\build\\pypy\\.hypothesis\\examples')
pytest-2.9.2 from d:\pypy_stuff\buildbot64\slave\own-win-x86-64\build\pytest.pyc
rootdir: d:\pypy_stuff\buildbot64\slave\own-win-x86-64\build, inifile: pytest.ini
plugins: hypothesis-4.39.3
collected 0 items / 1 skipped
========================== 1 skipped in 0.03 seconds ==========================
++ 03:31:07 starting module/cpyext/test/test_codecs.py [50 started in total]
__ module/cpyext/test/test_bytesobject.py [47 done in total, somefailed=False]
============================= test session starts =============================
platform win32 -- Python 2.7.18[pypy-7.3.18-alpha], pytest-2.9.2, py-1.4.29, pluggy-0.3.1
hypothesis profile 'default' -> deadline=None, database=DirectoryBasedExampleDatabase('d:\\pypy_stuff\\buildbot64\\slave\\own-win-x86-64\\build\\pypy\\.hypothesis\\examples')
pytest-2.9.2 from d:\pypy_stuff\buildbot64\slave\own-win-x86-64\build\pytest.pyc
rootdir: d:\pypy_stuff\buildbot64\slave\own-win-x86-64\build, inifile: pytest.ini
plugins: hypothesis-4.39.3
collected 0 items / 1 skipped
========================== 1 skipped in 0.02 seconds ==========================
++ 03:31:09 starting module/cpyext/test/test_complexobject.py [51 started in total]
__ module/cpyext/test/test_cell.py [48 done in total, somefailed=False] _______
============================= test session starts =============================
platform win32 -- Python 2.7.18[pypy-7.3.18-alpha], pytest-2.9.2, py-1.4.29, pluggy-0.3.1
hypothesis profile 'default' -> deadline=None, database=DirectoryBasedExampleDatabase('d:\\pypy_stuff\\buildbot64\\slave\\own-win-x86-64\\build\\pypy\\.hypothesis\\examples')
pytest-2.9.2 from d:\pypy_stuff\buildbot64\slave\own-win-x86-64\build\pytest.pyc
rootdir: d:\pypy_stuff\buildbot64\slave\own-win-x86-64\build, inifile: pytest.ini
plugins: hypothesis-4.39.3
collected 0 items / 1 skipped
========================== 1 skipped in 0.02 seconds ==========================
++ 03:31:11 starting module/cpyext/test/test_cpyext.py [52 started in total]
__ module/cpyext/test/test_classobject.py [49 done in total, somefailed=False]
============================= test session starts =============================
platform win32 -- Python 2.7.18[pypy-7.3.18-alpha], pytest-2.9.2, py-1.4.29, pluggy-0.3.1
hypothesis profile 'default' -> deadline=None, database=DirectoryBasedExampleDatabase('d:\\pypy_stuff\\buildbot64\\slave\\own-win-x86-64\\build\\pypy\\.hypothesis\\examples')
pytest-2.9.2 from d:\pypy_stuff\buildbot64\slave\own-win-x86-64\build\pytest.pyc
rootdir: d:\pypy_stuff\buildbot64\slave\own-win-x86-64\build, inifile: pytest.ini
plugins: hypothesis-4.39.3
collected 0 items / 1 skipped
========================== 1 skipped in 0.02 seconds ==========================
++ 03:31:15 starting module/cpyext/test/test_datetime.py [53 started in total]
__ module/cpyext/test/test_codecs.py [50 done in total, somefailed=False] _____
============================= test session starts =============================
platform win32 -- Python 2.7.18[pypy-7.3.18-alpha], pytest-2.9.2, py-1.4.29, pluggy-0.3.1
hypothesis profile 'default' -> deadline=None, database=DirectoryBasedExampleDatabase('d:\\pypy_stuff\\buildbot64\\slave\\own-win-x86-64\\build\\pypy\\.hypothesis\\examples')
pytest-2.9.2 from d:\pypy_stuff\buildbot64\slave\own-win-x86-64\build\pytest.pyc
rootdir: d:\pypy_stuff\buildbot64\slave\own-win-x86-64\build, inifile: pytest.ini
plugins: hypothesis-4.39.3
collected 0 items / 1 skipped
========================== 1 skipped in 0.03 seconds ==========================
++ 03:31:27 starting module/cpyext/test/test_dictobject.py [54 started in total]
__ module/cpyext/test/test_complexobject.py [51 done in total, somefailed=False]
============================= test session starts =============================
platform win32 -- Python 2.7.18[pypy-7.3.18-alpha], pytest-2.9.2, py-1.4.29, pluggy-0.3.1
hypothesis profile 'default' -> deadline=None, database=DirectoryBasedExampleDatabase('d:\\pypy_stuff\\buildbot64\\slave\\own-win-x86-64\\build\\pypy\\.hypothesis\\examples')
pytest-2.9.2 from d:\pypy_stuff\buildbot64\slave\own-win-x86-64\build\pytest.pyc
rootdir: d:\pypy_stuff\buildbot64\slave\own-win-x86-64\build, inifile: pytest.ini
plugins: hypothesis-4.39.3
collected 0 items / 1 skipped
========================== 1 skipped in 0.02 seconds ==========================
++ 03:31:34 starting module/cpyext/test/test_eval.py [55 started in total]
__ module/cpyext/test/test_cpyext.py [52 done in total, somefailed=False] _____
============================= test session starts =============================
platform win32 -- Python 2.7.18[pypy-7.3.18-alpha], pytest-2.9.2, py-1.4.29, pluggy-0.3.1
hypothesis profile 'default' -> deadline=None, database=DirectoryBasedExampleDatabase('d:\\pypy_stuff\\buildbot64\\slave\\own-win-x86-64\\build\\pypy\\.hypothesis\\examples')
pytest-2.9.2 from d:\pypy_stuff\buildbot64\slave\own-win-x86-64\build\pytest.pyc
rootdir: d:\pypy_stuff\buildbot64\slave\own-win-x86-64\build, inifile: pytest.ini
plugins: hypothesis-4.39.3
collected 0 items / 1 skipped
========================== 1 skipped in 0.02 seconds ==========================
++ 03:31:35 starting module/cpyext/test/test_fileobject.py [56 started in total]
__ module/cpyext/test/test_datetime.py [53 done in total, somefailed=False] ___
============================= test session starts =============================
platform win32 -- Python 2.7.18[pypy-7.3.18-alpha], pytest-2.9.2, py-1.4.29, pluggy-0.3.1
hypothesis profile 'default' -> deadline=None, database=DirectoryBasedExampleDatabase('d:\\pypy_stuff\\buildbot64\\slave\\own-win-x86-64\\build\\pypy\\.hypothesis\\examples')
pytest-2.9.2 from d:\pypy_stuff\buildbot64\slave\own-win-x86-64\build\pytest.pyc
rootdir: d:\pypy_stuff\buildbot64\slave\own-win-x86-64\build, inifile: pytest.ini
plugins: hypothesis-4.39.3
collected 0 items / 1 skipped
========================== 1 skipped in 0.02 seconds ==========================
++ 03:31:36 starting module/cpyext/test/test_floatobject.py [57 started in total]
__ module/cpyext/test/test_dictobject.py [54 done in total, somefailed=False] _
============================= test session starts =============================
platform win32 -- Python 2.7.18[pypy-7.3.18-alpha], pytest-2.9.2, py-1.4.29, pluggy-0.3.1
hypothesis profile 'default' -> deadline=None, database=DirectoryBasedExampleDatabase('d:\\pypy_stuff\\buildbot64\\slave\\own-win-x86-64\\build\\pypy\\.hypothesis\\examples')
pytest-2.9.2 from d:\pypy_stuff\buildbot64\slave\own-win-x86-64\build\pytest.pyc
rootdir: d:\pypy_stuff\buildbot64\slave\own-win-x86-64\build, inifile: pytest.ini
plugins: hypothesis-4.39.3
collected 0 items / 1 skipped
========================== 1 skipped in 0.02 seconds ==========================
++ 03:31:48 starting module/cpyext/test/test_frameobject.py [58 started in total]
__ module/cpyext/test/test_eval.py [55 done in total, somefailed=False] _______
============================= test session starts =============================
platform win32 -- Python 2.7.18[pypy-7.3.18-alpha], pytest-2.9.2, py-1.4.29, pluggy-0.3.1
hypothesis profile 'default' -> deadline=None, database=DirectoryBasedExampleDatabase('d:\\pypy_stuff\\buildbot64\\slave\\own-win-x86-64\\build\\pypy\\.hypothesis\\examples')
pytest-2.9.2 from d:\pypy_stuff\buildbot64\slave\own-win-x86-64\build\pytest.pyc
rootdir: d:\pypy_stuff\buildbot64\slave\own-win-x86-64\build, inifile: pytest.ini
plugins: hypothesis-4.39.3
collected 0 items / 1 skipped
========================== 1 skipped in 0.02 seconds ==========================
++ 03:31:58 starting module/cpyext/test/test_funcobject.py [59 started in total]
__ module/cpyext/test/test_fileobject.py [56 done in total, somefailed=False] _
============================= test session starts =============================
platform win32 -- Python 2.7.18[pypy-7.3.18-alpha], pytest-2.9.2, py-1.4.29, pluggy-0.3.1
hypothesis profile 'default' -> deadline=None, database=DirectoryBasedExampleDatabase('d:\\pypy_stuff\\buildbot64\\slave\\own-win-x86-64\\build\\pypy\\.hypothesis\\examples')
pytest-2.9.2 from d:\pypy_stuff\buildbot64\slave\own-win-x86-64\build\pytest.pyc
rootdir: d:\pypy_stuff\buildbot64\slave\own-win-x86-64\build, inifile: pytest.ini
plugins: hypothesis-4.39.3
collected 0 items / 1 skipped
========================== 1 skipped in 0.02 seconds ==========================
++ 03:32:00 starting module/cpyext/test/test_genobject.py [60 started in total]
__ module/cpyext/test/test_floatobject.py [57 done in total, somefailed=False]
============================= test session starts =============================
platform win32 -- Python 2.7.18[pypy-7.3.18-alpha], pytest-2.9.2, py-1.4.29, pluggy-0.3.1
hypothesis profile 'default' -> deadline=None, database=DirectoryBasedExampleDatabase('d:\\pypy_stuff\\buildbot64\\slave\\own-win-x86-64\\build\\pypy\\.hypothesis\\examples')
pytest-2.9.2 from d:\pypy_stuff\buildbot64\slave\own-win-x86-64\build\pytest.pyc
rootdir: d:\pypy_stuff\buildbot64\slave\own-win-x86-64\build, inifile: pytest.ini
plugins: hypothesis-4.39.3
collected 0 items / 1 skipped
========================== 1 skipped in 0.02 seconds ==========================
++ 03:32:00 starting module/cpyext/test/test_getargs.py [61 started in total]
__ module/cpyext/test/test_frameobject.py [58 done in total, somefailed=False]
============================= test session starts =============================
platform win32 -- Python 2.7.18[pypy-7.3.18-alpha], pytest-2.9.2, py-1.4.29, pluggy-0.3.1
hypothesis profile 'default' -> deadline=None, database=DirectoryBasedExampleDatabase('d:\\pypy_stuff\\buildbot64\\slave\\own-win-x86-64\\build\\pypy\\.hypothesis\\examples')
pytest-2.9.2 from d:\pypy_stuff\buildbot64\slave\own-win-x86-64\build\pytest.pyc
rootdir: d:\pypy_stuff\buildbot64\slave\own-win-x86-64\build, inifile: pytest.ini
plugins: hypothesis-4.39.3
collected 0 items / 1 skipped
========================== 1 skipped in 0.02 seconds ==========================
++ 03:32:06 starting module/cpyext/test/test_import.py [62 started in total]
__ module/cpyext/test/test_getargs.py [59 done in total, somefailed=False] ____
============================= test session starts =============================
platform win32 -- Python 2.7.18[pypy-7.3.18-alpha], pytest-2.9.2, py-1.4.29, pluggy-0.3.1
hypothesis profile 'default' -> deadline=None, database=DirectoryBasedExampleDatabase('d:\\pypy_stuff\\buildbot64\\slave\\own-win-x86-64\\build\\pypy\\.hypothesis\\examples')
pytest-2.9.2 from d:\pypy_stuff\buildbot64\slave\own-win-x86-64\build\pytest.pyc
rootdir: d:\pypy_stuff\buildbot64\slave\own-win-x86-64\build, inifile: pytest.ini
plugins: hypothesis-4.39.3
collected 0 items / 1 skipped
========================== 1 skipped in 0.02 seconds ==========================
++ 03:32:21 starting module/cpyext/test/test_intobject.py [63 started in total]
__ module/cpyext/test/test_funcobject.py [60 done in total, somefailed=False] _
============================= test session starts =============================
platform win32 -- Python 2.7.18[pypy-7.3.18-alpha], pytest-2.9.2, py-1.4.29, pluggy-0.3.1
hypothesis profile 'default' -> deadline=None, database=DirectoryBasedExampleDatabase('d:\\pypy_stuff\\buildbot64\\slave\\own-win-x86-64\\build\\pypy\\.hypothesis\\examples')
pytest-2.9.2 from d:\pypy_stuff\buildbot64\slave\own-win-x86-64\build\pytest.pyc
rootdir: d:\pypy_stuff\buildbot64\slave\own-win-x86-64\build, inifile: pytest.ini
plugins: hypothesis-4.39.3
collected 0 items / 1 skipped
========================== 1 skipped in 0.02 seconds ==========================
++ 03:32:23 starting module/cpyext/test/test_iterator.py [64 started in total]
__ module/cpyext/test/test_genobject.py [61 done in total, somefailed=False] __
============================= test session starts =============================
platform win32 -- Python 2.7.18[pypy-7.3.18-alpha], pytest-2.9.2, py-1.4.29, pluggy-0.3.1
hypothesis profile 'default' -> deadline=None, database=DirectoryBasedExampleDatabase('d:\\pypy_stuff\\buildbot64\\slave\\own-win-x86-64\\build\\pypy\\.hypothesis\\examples')
pytest-2.9.2 from d:\pypy_stuff\buildbot64\slave\own-win-x86-64\build\pytest.pyc
rootdir: d:\pypy_stuff\buildbot64\slave\own-win-x86-64\build, inifile: pytest.ini
plugins: hypothesis-4.39.3
collected 0 items / 1 skipped
========================== 1 skipped in 0.01 seconds ==========================
++ 03:32:24 starting module/cpyext/test/test_listobject.py [65 started in total]
__ module/cpyext/test/test_import.py [62 done in total, somefailed=True] ______
INTERNALERROR> Traceback (most recent call last):
INTERNALERROR> File "d:\pypy_stuff\buildbot64\slave\own-win-x86-64\build\_pytest\main.py", line 90, in wrap_session
INTERNALERROR> config._do_configure()
INTERNALERROR> File "d:\pypy_stuff\buildbot64\slave\own-win-x86-64\build\_pytest\config.py", line 839, in _do_configure
INTERNALERROR> self.hook.pytest_configure.call_historic(kwargs=dict(config=self))
INTERNALERROR> File "d:\pypy_stuff\buildbot64\slave\own-win-x86-64\build\_pytest\vendored_packages\pluggy.py", line 729, in call_historic
INTERNALERROR> self._hookexec(self, self._nonwrappers + self._wrappers, kwargs)
INTERNALERROR> File "d:\pypy_stuff\buildbot64\slave\own-win-x86-64\build\_pytest\vendored_packages\pluggy.py", line 338, in _hookexec
INTERNALERROR> return self._inner_hookexec(hook, methods, kwargs)
INTERNALERROR> File "d:\pypy_stuff\buildbot64\slave\own-win-x86-64\build\_pytest\vendored_packages\pluggy.py", line 333, in <lambda>
INTERNALERROR> _MultiCall(methods, kwargs, hook.spec_opts).execute()
INTERNALERROR> File "d:\pypy_stuff\buildbot64\slave\own-win-x86-64\build\_pytest\vendored_packages\pluggy.py", line 596, in execute
INTERNALERROR> res = hook_impl.function(*args)
INTERNALERROR> File "d:\pypy_stuff\buildbot64\slave\own-win-x86-64\build\pypy\module\cpyext\test\conftest.py", line 41, in pytest_configure
INTERNALERROR> import pypy.module.cpyext.test.test_cpyext
INTERNALERROR> File "d:\pypy_stuff\buildbot64\slave\own-win-x86-64\build\pypy\module\cpyext\test\test_cpyext.py", line 17, in <module>
INTERNALERROR> import pypy.module.cpyext.moduledef # Make sure all the functions are registered
INTERNALERROR> File "d:\pypy_stuff\buildbot64\slave\own-win-x86-64\build\pypy\module\cpyext\moduledef.py", line 75, in <module>
INTERNALERROR> api.configure_types()
INTERNALERROR> File "d:\pypy_stuff\buildbot64\slave\own-win-x86-64\build\pypy\module\cpyext\api.py", line 792, in configure_types
INTERNALERROR> for name, TYPE in rffi_platform.configure(config).iteritems():
INTERNALERROR> File "d:\pypy_stuff\buildbot64\slave\own-win-x86-64\build\rpython\rtyper\tool\rffi_platform.py", line 216, in configure
INTERNALERROR> for name, result in zip(entries, results):
INTERNALERROR> File "d:\pypy_stuff\buildbot64\slave\own-win-x86-64\build\rpython\rtyper\tool\rffi_platform.py", line 241, in configure_entries
INTERNALERROR> writer.path, eci, ignore_errors=ignore_errors))
INTERNALERROR> File "d:\pypy_stuff\buildbot64\slave\own-win-x86-64\build\rpython\rtyper\tool\rffi_platform.py", line 745, in run_example_code
INTERNALERROR> output = build_executable_cache(files, eci, ignore_errors=ignore_errors)
INTERNALERROR> File "d:\pypy_stuff\buildbot64\slave\own-win-x86-64\build\rpython\tool\gcc_cache.py", line 28, in build_executable_cache
INTERNALERROR> result = platform.execute(platform.compile(c_files, eci))
INTERNALERROR> File "d:\pypy_stuff\buildbot64\slave\own-win-x86-64\build\rpython\translator\platform\__init__.py", line 57, in compile
INTERNALERROR> ofiles = self._compile_o_files(cfiles, eci, standalone)
INTERNALERROR> File "d:\pypy_stuff\buildbot64\slave\own-win-x86-64\build\rpython\translator\platform\__init__.py", line 79, in _compile_o_files
INTERNALERROR> ofiles.append(self._compile_c_file(self.cc, cfile, compile_args))
INTERNALERROR> File "d:\pypy_stuff\buildbot64\slave\own-win-x86-64\build\rpython\translator\platform\windows.py", line 290, in _compile_c_file
INTERNALERROR> self._execute_c_compiler(cc, args, oname)
INTERNALERROR> File "d:\pypy_stuff\buildbot64\slave\own-win-x86-64\build\rpython\translator\platform\__init__.py", line 143, in _execute_c_compiler
INTERNALERROR> self._handle_error(returncode, stdout, stderr, outname)
INTERNALERROR> File "d:\pypy_stuff\buildbot64\slave\own-win-x86-64\build\rpython\translator\platform\windows.py", line 319, in _handle_error
INTERNALERROR> raise CompilationError(stdout, stderr)
INTERNALERROR> CompilationError: CompilationError(out="""
INTERNALERROR> """)
++ 03:32:27 starting module/cpyext/test/test_longobject.py [66 started in total]
__ module/cpyext/test/test_intobject.py [63 done in total, somefailed=False] __
============================= test session starts =============================
platform win32 -- Python 2.7.18[pypy-7.3.18-alpha], pytest-2.9.2, py-1.4.29, pluggy-0.3.1
hypothesis profile 'default' -> deadline=None, database=DirectoryBasedExampleDatabase('d:\\pypy_stuff\\buildbot64\\slave\\own-win-x86-64\\build\\pypy\\.hypothesis\\examples')
pytest-2.9.2 from d:\pypy_stuff\buildbot64\slave\own-win-x86-64\build\pytest.pyc
rootdir: d:\pypy_stuff\buildbot64\slave\own-win-x86-64\build, inifile: pytest.ini
plugins: hypothesis-4.39.3
collected 0 items / 1 skipped
========================== 1 skipped in 0.02 seconds ==========================
++ 03:32:42 starting module/cpyext/test/test_mapping.py [67 started in total]
__ module/cpyext/test/test_listobject.py [64 done in total, somefailed=False] _
============================= test session starts =============================
platform win32 -- Python 2.7.18[pypy-7.3.18-alpha], pytest-2.9.2, py-1.4.29, pluggy-0.3.1
hypothesis profile 'default' -> deadline=None, database=DirectoryBasedExampleDatabase('d:\\pypy_stuff\\buildbot64\\slave\\own-win-x86-64\\build\\pypy\\.hypothesis\\examples')
pytest-2.9.2 from d:\pypy_stuff\buildbot64\slave\own-win-x86-64\build\pytest.pyc
rootdir: d:\pypy_stuff\buildbot64\slave\own-win-x86-64\build, inifile: pytest.ini
plugins: hypothesis-4.39.3
collected 0 items / 1 skipped
========================== 1 skipped in 0.02 seconds ==========================
++ 03:32:45 starting module/cpyext/test/test_marshal.py [68 started in total]
__ module/cpyext/test/test_iterator.py [65 done in total, somefailed=False] ___
============================= test session starts =============================
platform win32 -- Python 2.7.18[pypy-7.3.18-alpha], pytest-2.9.2, py-1.4.29, pluggy-0.3.1
hypothesis profile 'default' -> deadline=None, database=DirectoryBasedExampleDatabase('d:\\pypy_stuff\\buildbot64\\slave\\own-win-x86-64\\build\\pypy\\.hypothesis\\examples')
pytest-2.9.2 from d:\pypy_stuff\buildbot64\slave\own-win-x86-64\build\pytest.pyc
rootdir: d:\pypy_stuff\buildbot64\slave\own-win-x86-64\build, inifile: pytest.ini
plugins: hypothesis-4.39.3
collected 0 items / 1 skipped
========================== 1 skipped in 0.02 seconds ==========================
++ 03:32:47 starting module/cpyext/test/test_memoryobject.py [69 started in total]
__ module/cpyext/test/test_longobject.py [66 done in total, somefailed=False] _
============================= test session starts =============================
platform win32 -- Python 2.7.18[pypy-7.3.18-alpha], pytest-2.9.2, py-1.4.29, pluggy-0.3.1
hypothesis profile 'default' -> deadline=None, database=DirectoryBasedExampleDatabase('d:\\pypy_stuff\\buildbot64\\slave\\own-win-x86-64\\build\\pypy\\.hypothesis\\examples')
pytest-2.9.2 from d:\pypy_stuff\buildbot64\slave\own-win-x86-64\build\pytest.pyc
rootdir: d:\pypy_stuff\buildbot64\slave\own-win-x86-64\build, inifile: pytest.ini
plugins: hypothesis-4.39.3
collected 0 items / 1 skipped
========================== 1 skipped in 0.02 seconds ==========================
++ 03:32:48 starting module/cpyext/test/test_methodobject.py [70 started in total]
__ module/cpyext/test/test_mapping.py [67 done in total, somefailed=False] ____
============================= test session starts =============================
platform win32 -- Python 2.7.18[pypy-7.3.18-alpha], pytest-2.9.2, py-1.4.29, pluggy-0.3.1
hypothesis profile 'default' -> deadline=None, database=DirectoryBasedExampleDatabase('d:\\pypy_stuff\\buildbot64\\slave\\own-win-x86-64\\build\\pypy\\.hypothesis\\examples')
pytest-2.9.2 from d:\pypy_stuff\buildbot64\slave\own-win-x86-64\build\pytest.pyc
rootdir: d:\pypy_stuff\buildbot64\slave\own-win-x86-64\build, inifile: pytest.ini
plugins: hypothesis-4.39.3
collected 0 items / 1 skipped
========================== 1 skipped in 0.02 seconds ==========================
++ 03:33:03 starting module/cpyext/test/test_misc.py [71 started in total]
__ module/cpyext/test/test_methodobject.py [68 done in total, somefailed=False]
============================= test session starts =============================
platform win32 -- Python 2.7.18[pypy-7.3.18-alpha], pytest-2.9.2, py-1.4.29, pluggy-0.3.1
hypothesis profile 'default' -> deadline=None, database=DirectoryBasedExampleDatabase('d:\\pypy_stuff\\buildbot64\\slave\\own-win-x86-64\\build\\pypy\\.hypothesis\\examples')
pytest-2.9.2 from d:\pypy_stuff\buildbot64\slave\own-win-x86-64\build\pytest.pyc
rootdir: d:\pypy_stuff\buildbot64\slave\own-win-x86-64\build, inifile: pytest.ini
plugins: hypothesis-4.39.3
collected 0 items / 1 skipped
========================== 1 skipped in 0.02 seconds ==========================
++ 03:33:08 starting module/cpyext/test/test_module.py [72 started in total]
__ module/cpyext/test/test_marshal.py [69 done in total, somefailed=False] ____
============================= test session starts =============================
platform win32 -- Python 2.7.18[pypy-7.3.18-alpha], pytest-2.9.2, py-1.4.29, pluggy-0.3.1
hypothesis profile 'default' -> deadline=None, database=DirectoryBasedExampleDatabase('d:\\pypy_stuff\\buildbot64\\slave\\own-win-x86-64\\build\\pypy\\.hypothesis\\examples')
pytest-2.9.2 from d:\pypy_stuff\buildbot64\slave\own-win-x86-64\build\pytest.pyc
rootdir: d:\pypy_stuff\buildbot64\slave\own-win-x86-64\build, inifile: pytest.ini
plugins: hypothesis-4.39.3
collected 0 items / 1 skipped
========================== 1 skipped in 0.02 seconds ==========================
++ 03:33:09 starting module/cpyext/test/test_ndarrayobject.py [73 started in total]
__ module/cpyext/test/test_memoryobject.py [70 done in total, somefailed=False]
============================= test session starts =============================
platform win32 -- Python 2.7.18[pypy-7.3.18-alpha], pytest-2.9.2, py-1.4.29, pluggy-0.3.1
hypothesis profile 'default' -> deadline=None, database=DirectoryBasedExampleDatabase('d:\\pypy_stuff\\buildbot64\\slave\\own-win-x86-64\\build\\pypy\\.hypothesis\\examples')
pytest-2.9.2 from d:\pypy_stuff\buildbot64\slave\own-win-x86-64\build\pytest.pyc
rootdir: d:\pypy_stuff\buildbot64\slave\own-win-x86-64\build, inifile: pytest.ini
plugins: hypothesis-4.39.3
collected 0 items / 1 skipped
========================== 1 skipped in 0.01 seconds ==========================
++ 03:33:12 starting module/cpyext/test/test_number.py [74 started in total]
__ module/cpyext/test/test_misc.py [71 done in total, somefailed=False] _______
============================= test session starts =============================
platform win32 -- Python 2.7.18[pypy-7.3.18-alpha], pytest-2.9.2, py-1.4.29, pluggy-0.3.1
hypothesis profile 'default' -> deadline=None, database=DirectoryBasedExampleDatabase('d:\\pypy_stuff\\buildbot64\\slave\\own-win-x86-64\\build\\pypy\\.hypothesis\\examples')
pytest-2.9.2 from d:\pypy_stuff\buildbot64\slave\own-win-x86-64\build\pytest.pyc
rootdir: d:\pypy_stuff\buildbot64\slave\own-win-x86-64\build, inifile: pytest.ini
plugins: hypothesis-4.39.3
collected 0 items / 1 skipped
========================== 1 skipped in 0.02 seconds ==========================
++ 03:33:23 starting module/cpyext/test/test_object.py [75 started in total]
__ module/cpyext/test/test_module.py [72 done in total, somefailed=False] _____
============================= test session starts =============================
platform win32 -- Python 2.7.18[pypy-7.3.18-alpha], pytest-2.9.2, py-1.4.29, pluggy-0.3.1
hypothesis profile 'default' -> deadline=None, database=DirectoryBasedExampleDatabase('d:\\pypy_stuff\\buildbot64\\slave\\own-win-x86-64\\build\\pypy\\.hypothesis\\examples')
pytest-2.9.2 from d:\pypy_stuff\buildbot64\slave\own-win-x86-64\build\pytest.pyc
rootdir: d:\pypy_stuff\buildbot64\slave\own-win-x86-64\build, inifile: pytest.ini
plugins: hypothesis-4.39.3
collected 0 items / 1 skipped
========================== 1 skipped in 0.02 seconds ==========================
++ 03:33:29 starting module/cpyext/test/test_pycobject.py [76 started in total]
__ module/cpyext/test/test_ndarrayobject.py [73 done in total, somefailed=False]
============================= test session starts =============================
platform win32 -- Python 2.7.18[pypy-7.3.18-alpha], pytest-2.9.2, py-1.4.29, pluggy-0.3.1
hypothesis profile 'default' -> deadline=None, database=DirectoryBasedExampleDatabase('d:\\pypy_stuff\\buildbot64\\slave\\own-win-x86-64\\build\\pypy\\.hypothesis\\examples')
pytest-2.9.2 from d:\pypy_stuff\buildbot64\slave\own-win-x86-64\build\pytest.pyc
rootdir: d:\pypy_stuff\buildbot64\slave\own-win-x86-64\build, inifile: pytest.ini
plugins: hypothesis-4.39.3
collected 0 items / 1 skipped
========================== 1 skipped in 0.02 seconds ==========================
++ 03:33:34 starting module/cpyext/test/test_pyerrors.py [77 started in total]
__ module/cpyext/test/test_number.py [74 done in total, somefailed=False] _____
============================= test session starts =============================
platform win32 -- Python 2.7.18[pypy-7.3.18-alpha], pytest-2.9.2, py-1.4.29, pluggy-0.3.1
hypothesis profile 'default' -> deadline=None, database=DirectoryBasedExampleDatabase('d:\\pypy_stuff\\buildbot64\\slave\\own-win-x86-64\\build\\pypy\\.hypothesis\\examples')
pytest-2.9.2 from d:\pypy_stuff\buildbot64\slave\own-win-x86-64\build\pytest.pyc
rootdir: d:\pypy_stuff\buildbot64\slave\own-win-x86-64\build, inifile: pytest.ini
plugins: hypothesis-4.39.3
collected 0 items / 1 skipped
========================== 1 skipped in 0.02 seconds ==========================
++ 03:33:36 starting module/cpyext/test/test_pyfile.py [78 started in total]
__ module/cpyext/test/test_object.py [75 done in total, somefailed=False] _____
============================= test session starts =============================
platform win32 -- Python 2.7.18[pypy-7.3.18-alpha], pytest-2.9.2, py-1.4.29, pluggy-0.3.1
hypothesis profile 'default' -> deadline=None, database=DirectoryBasedExampleDatabase('d:\\pypy_stuff\\buildbot64\\slave\\own-win-x86-64\\build\\pypy\\.hypothesis\\examples')
pytest-2.9.2 from d:\pypy_stuff\buildbot64\slave\own-win-x86-64\build\pytest.pyc
rootdir: d:\pypy_stuff\buildbot64\slave\own-win-x86-64\build, inifile: pytest.ini
plugins: hypothesis-4.39.3
collected 0 items / 1 skipped
========================== 1 skipped in 0.02 seconds ==========================
++ 03:33:44 starting module/cpyext/test/test_pysignals.py [79 started in total]
__ module/cpyext/test/test_pycobject.py [76 done in total, somefailed=False] __
============================= test session starts =============================
platform win32 -- Python 2.7.18[pypy-7.3.18-alpha], pytest-2.9.2, py-1.4.29, pluggy-0.3.1
hypothesis profile 'default' -> deadline=None, database=DirectoryBasedExampleDatabase('d:\\pypy_stuff\\buildbot64\\slave\\own-win-x86-64\\build\\pypy\\.hypothesis\\examples')
pytest-2.9.2 from d:\pypy_stuff\buildbot64\slave\own-win-x86-64\build\pytest.pyc
rootdir: d:\pypy_stuff\buildbot64\slave\own-win-x86-64\build, inifile: pytest.ini
plugins: hypothesis-4.39.3
collected 0 items / 1 skipped
========================== 1 skipped in 0.02 seconds ==========================
++ 03:33:50 starting module/cpyext/test/test_pystate.py [80 started in total]
__ module/cpyext/test/test_pyerrors.py [77 done in total, somefailed=False] ___
============================= test session starts =============================
platform win32 -- Python 2.7.18[pypy-7.3.18-alpha], pytest-2.9.2, py-1.4.29, pluggy-0.3.1
hypothesis profile 'default' -> deadline=None, database=DirectoryBasedExampleDatabase('d:\\pypy_stuff\\buildbot64\\slave\\own-win-x86-64\\build\\pypy\\.hypothesis\\examples')
pytest-2.9.2 from d:\pypy_stuff\buildbot64\slave\own-win-x86-64\build\pytest.pyc
rootdir: d:\pypy_stuff\buildbot64\slave\own-win-x86-64\build, inifile: pytest.ini
plugins: hypothesis-4.39.3
collected 0 items / 1 skipped
========================== 1 skipped in 0.02 seconds ==========================
++ 03:33:54 starting module/cpyext/test/test_pystrtod.py [81 started in total]
__ module/cpyext/test/test_pyfile.py [78 done in total, somefailed=False] _____
============================= test session starts =============================
platform win32 -- Python 2.7.18[pypy-7.3.18-alpha], pytest-2.9.2, py-1.4.29, pluggy-0.3.1
hypothesis profile 'default' -> deadline=None, database=DirectoryBasedExampleDatabase('d:\\pypy_stuff\\buildbot64\\slave\\own-win-x86-64\\build\\pypy\\.hypothesis\\examples')
pytest-2.9.2 from d:\pypy_stuff\buildbot64\slave\own-win-x86-64\build\pytest.pyc
rootdir: d:\pypy_stuff\buildbot64\slave\own-win-x86-64\build, inifile: pytest.ini
plugins: hypothesis-4.39.3
collected 0 items / 1 skipped
========================== 1 skipped in 0.02 seconds ==========================
++ 03:34:01 starting module/cpyext/test/test_sequence.py [82 started in total]
__ module/cpyext/test/test_pysignals.py [79 done in total, somefailed=False] __
============================= test session starts =============================
platform win32 -- Python 2.7.18[pypy-7.3.18-alpha], pytest-2.9.2, py-1.4.29, pluggy-0.3.1
hypothesis profile 'default' -> deadline=None, database=DirectoryBasedExampleDatabase('d:\\pypy_stuff\\buildbot64\\slave\\own-win-x86-64\\build\\pypy\\.hypothesis\\examples')
pytest-2.9.2 from d:\pypy_stuff\buildbot64\slave\own-win-x86-64\build\pytest.pyc
rootdir: d:\pypy_stuff\buildbot64\slave\own-win-x86-64\build, inifile: pytest.ini
plugins: hypothesis-4.39.3
collected 0 items / 1 skipped
========================== 1 skipped in 0.02 seconds ==========================
++ 03:34:08 starting module/cpyext/test/test_setobject.py [83 started in total]
__ module/cpyext/test/test_pystate.py [80 done in total, somefailed=False] ____
============================= test session starts =============================
platform win32 -- Python 2.7.18[pypy-7.3.18-alpha], pytest-2.9.2, py-1.4.29, pluggy-0.3.1
hypothesis profile 'default' -> deadline=None, database=DirectoryBasedExampleDatabase('d:\\pypy_stuff\\buildbot64\\slave\\own-win-x86-64\\build\\pypy\\.hypothesis\\examples')
pytest-2.9.2 from d:\pypy_stuff\buildbot64\slave\own-win-x86-64\build\pytest.pyc
rootdir: d:\pypy_stuff\buildbot64\slave\own-win-x86-64\build, inifile: pytest.ini
plugins: hypothesis-4.39.3
collected 0 items / 1 skipped
========================== 1 skipped in 0.02 seconds ==========================
++ 03:34:10 starting module/cpyext/test/test_sliceobject.py [84 started in total]
__ module/cpyext/test/test_pystrtod.py [81 done in total, somefailed=False] ___
============================= test session starts =============================
platform win32 -- Python 2.7.18[pypy-7.3.18-alpha], pytest-2.9.2, py-1.4.29, pluggy-0.3.1
hypothesis profile 'default' -> deadline=None, database=DirectoryBasedExampleDatabase('d:\\pypy_stuff\\buildbot64\\slave\\own-win-x86-64\\build\\pypy\\.hypothesis\\examples')
pytest-2.9.2 from d:\pypy_stuff\buildbot64\slave\own-win-x86-64\build\pytest.pyc
rootdir: d:\pypy_stuff\buildbot64\slave\own-win-x86-64\build, inifile: pytest.ini
plugins: hypothesis-4.39.3
collected 0 items / 1 skipped
========================== 1 skipped in 0.02 seconds ==========================
++ 03:34:15 starting module/cpyext/test/test_structseq.py [85 started in total]
__ module/cpyext/test/test_sequence.py [82 done in total, somefailed=False] ___
============================= test session starts =============================
platform win32 -- Python 2.7.18[pypy-7.3.18-alpha], pytest-2.9.2, py-1.4.29, pluggy-0.3.1
hypothesis profile 'default' -> deadline=None, database=DirectoryBasedExampleDatabase('d:\\pypy_stuff\\buildbot64\\slave\\own-win-x86-64\\build\\pypy\\.hypothesis\\examples')
pytest-2.9.2 from d:\pypy_stuff\buildbot64\slave\own-win-x86-64\build\pytest.pyc
rootdir: d:\pypy_stuff\buildbot64\slave\own-win-x86-64\build, inifile: pytest.ini
plugins: hypothesis-4.39.3
collected 0 items / 1 skipped
========================== 1 skipped in 0.02 seconds ==========================
++ 03:34:25 starting module/cpyext/test/test_sysmodule.py [86 started in total]
__ module/cpyext/test/test_setobject.py [83 done in total, somefailed=False] __
============================= test session starts =============================
platform win32 -- Python 2.7.18[pypy-7.3.18-alpha], pytest-2.9.2, py-1.4.29, pluggy-0.3.1
hypothesis profile 'default' -> deadline=None, database=DirectoryBasedExampleDatabase('d:\\pypy_stuff\\buildbot64\\slave\\own-win-x86-64\\build\\pypy\\.hypothesis\\examples')
pytest-2.9.2 from d:\pypy_stuff\buildbot64\slave\own-win-x86-64\build\pytest.pyc
rootdir: d:\pypy_stuff\buildbot64\slave\own-win-x86-64\build, inifile: pytest.ini
plugins: hypothesis-4.39.3
collected 0 items / 1 skipped
========================== 1 skipped in 0.02 seconds ==========================
++ 03:34:29 starting module/cpyext/test/test_thread.py [87 started in total]
__ module/cpyext/test/test_sliceobject.py [84 done in total, somefailed=False]
============================= test session starts =============================
platform win32 -- Python 2.7.18[pypy-7.3.18-alpha], pytest-2.9.2, py-1.4.29, pluggy-0.3.1
hypothesis profile 'default' -> deadline=None, database=DirectoryBasedExampleDatabase('d:\\pypy_stuff\\buildbot64\\slave\\own-win-x86-64\\build\\pypy\\.hypothesis\\examples')
pytest-2.9.2 from d:\pypy_stuff\buildbot64\slave\own-win-x86-64\build\pytest.pyc
rootdir: d:\pypy_stuff\buildbot64\slave\own-win-x86-64\build, inifile: pytest.ini
plugins: hypothesis-4.39.3
collected 0 items / 1 skipped
========================== 1 skipped in 0.02 seconds ==========================
++ 03:34:31 starting module/cpyext/test/test_traceback.py [88 started in total]
__ module/cpyext/test/test_structseq.py [85 done in total, somefailed=False] __
============================= test session starts =============================
platform win32 -- Python 2.7.18[pypy-7.3.18-alpha], pytest-2.9.2, py-1.4.29, pluggy-0.3.1
hypothesis profile 'default' -> deadline=None, database=DirectoryBasedExampleDatabase('d:\\pypy_stuff\\buildbot64\\slave\\own-win-x86-64\\build\\pypy\\.hypothesis\\examples')
pytest-2.9.2 from d:\pypy_stuff\buildbot64\slave\own-win-x86-64\build\pytest.pyc
rootdir: d:\pypy_stuff\buildbot64\slave\own-win-x86-64\build, inifile: pytest.ini
plugins: hypothesis-4.39.3
collected 0 items / 1 skipped
========================== 1 skipped in 0.02 seconds ==========================
++ 03:34:40 starting module/cpyext/test/test_translate.py [89 started in total]
__ module/cpyext/test/test_sysmodule.py [86 done in total, somefailed=False] __
============================= test session starts =============================
platform win32 -- Python 2.7.18[pypy-7.3.18-alpha], pytest-2.9.2, py-1.4.29, pluggy-0.3.1
hypothesis profile 'default' -> deadline=None, database=DirectoryBasedExampleDatabase('d:\\pypy_stuff\\buildbot64\\slave\\own-win-x86-64\\build\\pypy\\.hypothesis\\examples')
pytest-2.9.2 from d:\pypy_stuff\buildbot64\slave\own-win-x86-64\build\pytest.pyc
rootdir: d:\pypy_stuff\buildbot64\slave\own-win-x86-64\build, inifile: pytest.ini
plugins: hypothesis-4.39.3
collected 0 items / 1 skipped
========================== 1 skipped in 0.02 seconds ==========================
++ 03:34:49 starting module/cpyext/test/test_tupleobject.py [90 started in total]
__ module/cpyext/test/test_traceback.py [87 done in total, somefailed=False] __
============================= test session starts =============================
platform win32 -- Python 2.7.18[pypy-7.3.18-alpha], pytest-2.9.2, py-1.4.29, pluggy-0.3.1
hypothesis profile 'default' -> deadline=None, database=DirectoryBasedExampleDatabase('d:\\pypy_stuff\\buildbot64\\slave\\own-win-x86-64\\build\\pypy\\.hypothesis\\examples')
pytest-2.9.2 from d:\pypy_stuff\buildbot64\slave\own-win-x86-64\build\pytest.pyc
rootdir: d:\pypy_stuff\buildbot64\slave\own-win-x86-64\build, inifile: pytest.ini
plugins: hypothesis-4.39.3
collected 0 items / 1 skipped
========================== 1 skipped in 0.02 seconds ==========================
++ 03:34:52 starting module/cpyext/test/test_typeobject.py [91 started in total]
__ module/cpyext/test/test_thread.py [88 done in total, somefailed=False] _____
============================= test session starts =============================
platform win32 -- Python 2.7.18[pypy-7.3.18-alpha], pytest-2.9.2, py-1.4.29, pluggy-0.3.1
hypothesis profile 'default' -> deadline=None, database=DirectoryBasedExampleDatabase('d:\\pypy_stuff\\buildbot64\\slave\\own-win-x86-64\\build\\pypy\\.hypothesis\\examples')
pytest-2.9.2 from d:\pypy_stuff\buildbot64\slave\own-win-x86-64\build\pytest.pyc
rootdir: d:\pypy_stuff\buildbot64\slave\own-win-x86-64\build, inifile: pytest.ini
plugins: hypothesis-4.39.3
collected 0 items / 1 skipped
========================== 1 skipped in 0.02 seconds ==========================
++ 03:34:54 starting module/cpyext/test/test_unicodeobject.py [92 started in total]
__ module/cpyext/test/test_translate.py [89 done in total, somefailed=False] __
============================= test session starts =============================
platform win32 -- Python 2.7.18[pypy-7.3.18-alpha], pytest-2.9.2, py-1.4.29, pluggy-0.3.1
hypothesis profile 'default' -> deadline=None, database=DirectoryBasedExampleDatabase('d:\\pypy_stuff\\buildbot64\\slave\\own-win-x86-64\\build\\pypy\\.hypothesis\\examples')
pytest-2.9.2 from d:\pypy_stuff\buildbot64\slave\own-win-x86-64\build\pytest.pyc
rootdir: d:\pypy_stuff\buildbot64\slave\own-win-x86-64\build, inifile: pytest.ini
plugins: hypothesis-4.39.3
collected 0 items / 1 skipped
========================== 1 skipped in 0.02 seconds ==========================
++ 03:35:00 starting module/cpyext/test/test_userslots.py [93 started in total]
__ module/cpyext/test/test_tupleobject.py [90 done in total, somefailed=False]
============================= test session starts =============================
platform win32 -- Python 2.7.18[pypy-7.3.18-alpha], pytest-2.9.2, py-1.4.29, pluggy-0.3.1
hypothesis profile 'default' -> deadline=None, database=DirectoryBasedExampleDatabase('d:\\pypy_stuff\\buildbot64\\slave\\own-win-x86-64\\build\\pypy\\.hypothesis\\examples')
pytest-2.9.2 from d:\pypy_stuff\buildbot64\slave\own-win-x86-64\build\pytest.pyc
rootdir: d:\pypy_stuff\buildbot64\slave\own-win-x86-64\build, inifile: pytest.ini
plugins: hypothesis-4.39.3
collected 0 items / 1 skipped
========================== 1 skipped in 0.02 seconds ==========================
++ 03:35:10 starting module/cpyext/test/test_version.py [94 started in total]
__ module/cpyext/test/test_unicodeobject.py [91 done in total, somefailed=False]
============================= test session starts =============================
platform win32 -- Python 2.7.18[pypy-7.3.18-alpha], pytest-2.9.2, py-1.4.29, pluggy-0.3.1
hypothesis profile 'default' -> deadline=None, database=DirectoryBasedExampleDatabase('d:\\pypy_stuff\\buildbot64\\slave\\own-win-x86-64\\build\\pypy\\.hypothesis\\examples')
pytest-2.9.2 from d:\pypy_stuff\buildbot64\slave\own-win-x86-64\build\pytest.pyc
rootdir: d:\pypy_stuff\buildbot64\slave\own-win-x86-64\build, inifile: pytest.ini
plugins: hypothesis-4.39.3
collected 0 items / 1 skipped
========================== 1 skipped in 0.02 seconds ==========================
++ 03:35:14 starting module/cpyext/test/test_weakref.py [95 started in total]
__ module/cpyext/test/test_typeobject.py [92 done in total, somefailed=False] _
============================= test session starts =============================
platform win32 -- Python 2.7.18[pypy-7.3.18-alpha], pytest-2.9.2, py-1.4.29, pluggy-0.3.1
hypothesis profile 'default' -> deadline=None, database=DirectoryBasedExampleDatabase('d:\\pypy_stuff\\buildbot64\\slave\\own-win-x86-64\\build\\pypy\\.hypothesis\\examples')
pytest-2.9.2 from d:\pypy_stuff\buildbot64\slave\own-win-x86-64\build\pytest.pyc
rootdir: d:\pypy_stuff\buildbot64\slave\own-win-x86-64\build, inifile: pytest.ini
plugins: hypothesis-4.39.3
collected 0 items / 1 skipped
========================== 1 skipped in 0.02 seconds ==========================
++ 03:35:17 starting module/crypt/test [96 started in total]
__ module/crypt/test [93 done in total, somefailed=False] _____________________
============================= test session starts =============================
platform win32 -- Python 2.7.18[pypy-7.3.18-alpha], pytest-2.9.2, py-1.4.29, pluggy-0.3.1
hypothesis profile 'default' -> deadline=None, database=DirectoryBasedExampleDatabase('d:\\pypy_stuff\\buildbot64\\slave\\own-win-x86-64\\build\\pypy\\.hypothesis\\examples')
pytest-2.9.2 from d:\pypy_stuff\buildbot64\slave\own-win-x86-64\build\pytest.pyc
rootdir: d:\pypy_stuff\buildbot64\slave\own-win-x86-64\build, inifile: pytest.ini
plugins: hypothesis-4.39.3
collected 0 items / 1 skipped
========================== 1 skipped in 0.02 seconds ==========================
++ 03:35:18 starting module/errno/test [97 started in total]
__ module/cpyext/test/test_userslots.py [94 done in total, somefailed=False] __
============================= test session starts =============================
platform win32 -- Python 2.7.18[pypy-7.3.18-alpha], pytest-2.9.2, py-1.4.29, pluggy-0.3.1
hypothesis profile 'default' -> deadline=None, database=DirectoryBasedExampleDatabase('d:\\pypy_stuff\\buildbot64\\slave\\own-win-x86-64\\build\\pypy\\.hypothesis\\examples')
pytest-2.9.2 from d:\pypy_stuff\buildbot64\slave\own-win-x86-64\build\pytest.pyc
rootdir: d:\pypy_stuff\buildbot64\slave\own-win-x86-64\build, inifile: pytest.ini
plugins: hypothesis-4.39.3
collected 0 items / 1 skipped
========================== 1 skipped in 0.02 seconds ==========================
++ 03:35:21 starting module/exceptions/test [98 started in total]
__ module/errno/test [95 done in total, somefailed=False] _____________________
============================= test session starts =============================
platform win32 -- Python 2.7.18[pypy-7.3.18-alpha], pytest-2.9.2, py-1.4.29, pluggy-0.3.1
hypothesis profile 'default' -> deadline=None, database=DirectoryBasedExampleDatabase('d:\\pypy_stuff\\buildbot64\\slave\\own-win-x86-64\\build\\pypy\\.hypothesis\\examples')
pytest-2.9.2 from d:\pypy_stuff\buildbot64\slave\own-win-x86-64\build\pytest.pyc
rootdir: d:\pypy_stuff\buildbot64\slave\own-win-x86-64\build, inifile: pytest.ini
plugins: hypothesis-4.39.3
collected 3 items
module\errno\test\test_errno.py ...
========================== 3 passed in 12.38 seconds ==========================
++ 03:35:33 starting module/faulthandler/test [99 started in total]
__ module/cpyext/test/test_version.py [96 done in total, somefailed=False] ____
============================= test session starts =============================
platform win32 -- Python 2.7.18[pypy-7.3.18-alpha], pytest-2.9.2, py-1.4.29, pluggy-0.3.1
hypothesis profile 'default' -> deadline=None, database=DirectoryBasedExampleDatabase('d:\\pypy_stuff\\buildbot64\\slave\\own-win-x86-64\\build\\pypy\\.hypothesis\\examples')
pytest-2.9.2 from d:\pypy_stuff\buildbot64\slave\own-win-x86-64\build\pytest.pyc
rootdir: d:\pypy_stuff\buildbot64\slave\own-win-x86-64\build, inifile: pytest.ini
plugins: hypothesis-4.39.3
collected 0 items / 1 skipped
========================== 1 skipped in 0.02 seconds ==========================
++ 03:35:35 starting module/fcntl/test [100 started in total]
__ module/fcntl/test [97 done in total, somefailed=False] _____________________
============================= test session starts =============================
platform win32 -- Python 2.7.18[pypy-7.3.18-alpha], pytest-2.9.2, py-1.4.29, pluggy-0.3.1
hypothesis profile 'default' -> deadline=None, database=DirectoryBasedExampleDatabase('d:\\pypy_stuff\\buildbot64\\slave\\own-win-x86-64\\build\\pypy\\.hypothesis\\examples')
pytest-2.9.2 from d:\pypy_stuff\buildbot64\slave\own-win-x86-64\build\pytest.pyc
rootdir: d:\pypy_stuff\buildbot64\slave\own-win-x86-64\build, inifile: pytest.ini
plugins: hypothesis-4.39.3
collected 0 items / 1 skipped
========================== 1 skipped in 0.44 seconds ==========================
++ 03:35:36 starting module/gc/test [101 started in total]
__ module/exceptions/test [98 done in total, somefailed=False] ________________
============================= test session starts =============================
platform win32 -- Python 2.7.18[pypy-7.3.18-alpha], pytest-2.9.2, py-1.4.29, pluggy-0.3.1
hypothesis profile 'default' -> deadline=None, database=DirectoryBasedExampleDatabase('d:\\pypy_stuff\\buildbot64\\slave\\own-win-x86-64\\build\\pypy\\.hypothesis\\examples')
pytest-2.9.2 from d:\pypy_stuff\buildbot64\slave\own-win-x86-64\build\pytest.pyc
rootdir: d:\pypy_stuff\buildbot64\slave\own-win-x86-64\build, inifile: pytest.ini
plugins: hypothesis-4.39.3
collected 24 items
module\exceptions\test\test_exc.py ........................
========================= 24 passed in 15.17 seconds ==========================
++ 03:35:38 starting module/imp/test [102 started in total]
__ module/cpyext/test/test_weakref.py [99 done in total, somefailed=False] ____
============================= test session starts =============================
platform win32 -- Python 2.7.18[pypy-7.3.18-alpha], pytest-2.9.2, py-1.4.29, pluggy-0.3.1
hypothesis profile 'default' -> deadline=None, database=DirectoryBasedExampleDatabase('d:\\pypy_stuff\\buildbot64\\slave\\own-win-x86-64\\build\\pypy\\.hypothesis\\examples')
pytest-2.9.2 from d:\pypy_stuff\buildbot64\slave\own-win-x86-64\build\pytest.pyc
rootdir: d:\pypy_stuff\buildbot64\slave\own-win-x86-64\build, inifile: pytest.ini
plugins: hypothesis-4.39.3
collected 0 items / 1 skipped
========================== 1 skipped in 0.02 seconds ==========================
++ 03:35:39 starting module/itertools/test [103 started in total]
__ module/faulthandler/test [100 done in total, somefailed=False] _____________
============================= test session starts =============================
platform win32 -- Python 2.7.18[pypy-7.3.18-alpha], pytest-2.9.2, py-1.4.29, pluggy-0.3.1
hypothesis profile 'default' -> deadline=None, database=DirectoryBasedExampleDatabase('d:\\pypy_stuff\\buildbot64\\slave\\own-win-x86-64\\build\\pypy\\.hypothesis\\examples')
pytest-2.9.2 from d:\pypy_stuff\buildbot64\slave\own-win-x86-64\build\pytest.pyc
rootdir: d:\pypy_stuff\buildbot64\slave\own-win-x86-64\build, inifile: pytest.ini
plugins: hypothesis-4.39.3
collected 1 items / 1 skipped
module\faulthandler\test\test_ztranslation.py .
===================== 1 passed, 1 skipped in 6.72 seconds =====================
++ 03:35:42 starting module/marshal/test [104 started in total]
__ module/gc/test [101 done in total, somefailed=False] _______________________
============================= test session starts =============================
platform win32 -- Python 2.7.18[pypy-7.3.18-alpha], pytest-2.9.2, py-1.4.29, pluggy-0.3.1
hypothesis profile 'default' -> deadline=None, database=DirectoryBasedExampleDatabase('d:\\pypy_stuff\\buildbot64\\slave\\own-win-x86-64\\build\\pypy\\.hypothesis\\examples')
pytest-2.9.2 from d:\pypy_stuff\buildbot64\slave\own-win-x86-64\build\pytest.pyc
rootdir: d:\pypy_stuff\buildbot64\slave\own-win-x86-64\build, inifile: pytest.ini
plugins: hypothesis-4.39.3
collected 30 items
module\gc\test\test_app_referents.py ....
module\gc\test\test_gc.py .....x...
module\gc\test\test_hook.py ........
module\gc\test\test_referents.py ...s....
module\gc\test\test_ztranslation.py .
============== 28 passed, 1 skipped, 1 xfailed in 32.07 seconds ===============
++ 03:36:10 starting module/math/test [105 started in total]
__ module/marshal/test [102 done in total, somefailed=False] __________________
============================= test session starts =============================
platform win32 -- Python 2.7.18[pypy-7.3.18-alpha], pytest-2.9.2, py-1.4.29, pluggy-0.3.1
hypothesis profile 'default' -> deadline=None, database=DirectoryBasedExampleDatabase('d:\\pypy_stuff\\buildbot64\\slave\\own-win-x86-64\\build\\pypy\\.hypothesis\\examples')
pytest-2.9.2 from d:\pypy_stuff\buildbot64\slave\own-win-x86-64\build\pytest.pyc
rootdir: d:\pypy_stuff\buildbot64\slave\own-win-x86-64\build, inifile: pytest.ini
plugins: hypothesis-4.39.3
collected 80 items
module\marshal\test\test_marshal.py ...................................................................
module\marshal\test\test_marshalimpl.py .............
========================= 80 passed in 38.14 seconds ==========================
++ 03:36:27 starting module/micronumpy/test [106 started in total]
__ module/micronumpy/test [103 done in total, somefailed=False] _______________
============================= test session starts =============================
platform win32 -- Python 2.7.18[pypy-7.3.18-alpha], pytest-2.9.2, py-1.4.29, pluggy-0.3.1
hypothesis profile 'default' -> deadline=None, database=DirectoryBasedExampleDatabase('d:\\pypy_stuff\\buildbot64\\slave\\own-win-x86-64\\build\\pypy\\.hypothesis\\examples')
pytest-2.9.2 from d:\pypy_stuff\buildbot64\slave\own-win-x86-64\build\pytest.pyc
rootdir: d:\pypy_stuff\buildbot64\slave\own-win-x86-64\build, inifile: pytest.ini
plugins: hypothesis-4.39.3
collected 0 items
======================== no tests ran in 0.01 seconds =========================
++ 03:36:46 starting module/mmap/test [107 started in total]
__ module/itertools/test [104 done in total, somefailed=False] ________________
============================= test session starts =============================
platform win32 -- Python 2.7.18[pypy-7.3.18-alpha], pytest-2.9.2, py-1.4.29, pluggy-0.3.1
hypothesis profile 'default' -> deadline=None, database=DirectoryBasedExampleDatabase('d:\\pypy_stuff\\buildbot64\\slave\\own-win-x86-64\\build\\pypy\\.hypothesis\\examples')
pytest-2.9.2 from d:\pypy_stuff\buildbot64\slave\own-win-x86-64\build\pytest.pyc
rootdir: d:\pypy_stuff\buildbot64\slave\own-win-x86-64\build, inifile: pytest.ini
plugins: hypothesis-4.39.3
collected 73 items
module\itertools\test\test_itertools.py ........................................................................
module\itertools\test\test_ztranslation.py .
========================= 73 passed in 59.71 seconds ==========================
++ 03:36:46 starting module/operator/test [108 started in total]
__ module/math/test [105 done in total, somefailed=False] _____________________
============================= test session starts =============================
platform win32 -- Python 2.7.18[pypy-7.3.18-alpha], pytest-2.9.2, py-1.4.29, pluggy-0.3.1
hypothesis profile 'default' -> deadline=None, database=DirectoryBasedExampleDatabase('d:\\pypy_stuff\\buildbot64\\slave\\own-win-x86-64\\build\\pypy\\.hypothesis\\examples')
pytest-2.9.2 from d:\pypy_stuff\buildbot64\slave\own-win-x86-64\build\pytest.pyc
rootdir: d:\pypy_stuff\buildbot64\slave\own-win-x86-64\build, inifile: pytest.ini
plugins: hypothesis-4.39.3
collected 182 items
module\math\test\test_direct.py ......................................................................................................................................................................
module\math\test\test_factorial.py .s
module\math\test\test_math.py .........s....
=================== 180 passed, 2 skipped in 34.37 seconds ====================
++ 03:36:49 starting module/parser/test [109 started in total]
__ module/operator/test [106 done in total, somefailed=False] _________________
============================= test session starts =============================
platform win32 -- Python 2.7.18[pypy-7.3.18-alpha], pytest-2.9.2, py-1.4.29, pluggy-0.3.1
hypothesis profile 'default' -> deadline=None, database=DirectoryBasedExampleDatabase('d:\\pypy_stuff\\buildbot64\\slave\\own-win-x86-64\\build\\pypy\\.hypothesis\\examples')
pytest-2.9.2 from d:\pypy_stuff\buildbot64\slave\own-win-x86-64\build\pytest.pyc
rootdir: d:\pypy_stuff\buildbot64\slave\own-win-x86-64\build, inifile: pytest.ini
plugins: hypothesis-4.39.3
collected 27 items
module\operator\test\test_operator.py ..................
module\operator\test\test_tscmp.py .........
========================= 27 passed in 14.24 seconds ==========================
++ 03:37:04 starting module/posix/test [110 started in total]
__ module/parser/test [107 done in total, somefailed=False] ___________________
============================= test session starts =============================
platform win32 -- Python 2.7.18[pypy-7.3.18-alpha], pytest-2.9.2, py-1.4.29, pluggy-0.3.1
hypothesis profile 'default' -> deadline=None, database=DirectoryBasedExampleDatabase('d:\\pypy_stuff\\buildbot64\\slave\\own-win-x86-64\\build\\pypy\\.hypothesis\\examples')
pytest-2.9.2 from d:\pypy_stuff\buildbot64\slave\own-win-x86-64\build\pytest.pyc
rootdir: d:\pypy_stuff\buildbot64\slave\own-win-x86-64\build, inifile: pytest.ini
plugins: hypothesis-4.39.3
collected 7 items
module\parser\test\test_parser.py .......
========================== 7 passed in 12.46 seconds ==========================
++ 03:37:04 starting module/pwd/test [111 started in total]
__ module/pwd/test [108 done in total, somefailed=False] ______________________
============================= test session starts =============================
platform win32 -- Python 2.7.18[pypy-7.3.18-alpha], pytest-2.9.2, py-1.4.29, pluggy-0.3.1
hypothesis profile 'default' -> deadline=None, database=DirectoryBasedExampleDatabase('d:\\pypy_stuff\\buildbot64\\slave\\own-win-x86-64\\build\\pypy\\.hypothesis\\examples')
pytest-2.9.2 from d:\pypy_stuff\buildbot64\slave\own-win-x86-64\build\pytest.pyc
rootdir: d:\pypy_stuff\buildbot64\slave\own-win-x86-64\build, inifile: pytest.ini
plugins: hypothesis-4.39.3
collected 0 items / 2 skipped
========================== 2 skipped in 3.27 seconds ==========================
++ 03:37:09 starting module/pyexpat/test [112 started in total]
__ module/mmap/test [109 done in total, somefailed=False] _____________________
============================= test session starts =============================
platform win32 -- Python 2.7.18[pypy-7.3.18-alpha], pytest-2.9.2, py-1.4.29, pluggy-0.3.1
hypothesis profile 'default' -> deadline=None, database=DirectoryBasedExampleDatabase('d:\\pypy_stuff\\buildbot64\\slave\\own-win-x86-64\\build\\pypy\\.hypothesis\\examples')
pytest-2.9.2 from d:\pypy_stuff\buildbot64\slave\own-win-x86-64\build\pytest.pyc
rootdir: d:\pypy_stuff\buildbot64\slave\own-win-x86-64\build, inifile: pytest.ini
plugins: hypothesis-4.39.3
collected 43 items
module\mmap\test\test_mmap.py ....s.................s..............ss..s.
==================== 38 passed, 5 skipped in 20.79 seconds ====================
++ 03:37:10 starting module/pypyjit/test [113 started in total]
__ module/imp/test [110 done in total, somefailed=False] ______________________
============================= test session starts =============================
platform win32 -- Python 2.7.18[pypy-7.3.18-alpha], pytest-2.9.2, py-1.4.29, pluggy-0.3.1
hypothesis profile 'default' -> deadline=None, database=DirectoryBasedExampleDatabase('d:\\pypy_stuff\\buildbot64\\slave\\own-win-x86-64\\build\\pypy\\.hypothesis\\examples')
pytest-2.9.2 from d:\pypy_stuff\buildbot64\slave\own-win-x86-64\build\pytest.pyc
rootdir: d:\pypy_stuff\buildbot64\slave\own-win-x86-64\build, inifile: pytest.ini
plugins: hypothesis-4.39.3
collected 124 items
module\imp\test\test_app.py ................
module\imp\test\test_import.py ...........................................................................s............ss..................
=================== 121 passed, 3 skipped in 94.90 seconds ====================
++ 03:37:14 starting module/select/test [114 started in total]
__ module/pypyjit/test [111 done in total, somefailed=True] ___________________
============================= test session starts =============================
platform win32 -- Python 2.7.18[pypy-7.3.18-alpha], pytest-2.9.2, py-1.4.29, pluggy-0.3.1
hypothesis profile 'default' -> deadline=None, database=DirectoryBasedExampleDatabase('d:\\pypy_stuff\\buildbot64\\slave\\own-win-x86-64\\build\\pypy\\.hypothesis\\examples')
pytest-2.9.2 from d:\pypy_stuff\buildbot64\slave\own-win-x86-64\build\pytest.pyc
rootdir: d:\pypy_stuff\buildbot64\slave\own-win-x86-64\build, inifile: pytest.ini
plugins: hypothesis-4.39.3
collected 29 items
module\pypyjit\test\test_jit_hook.py .F......s
module\pypyjit\test\test_jit_not_in_trace.py ..
module\pypyjit\test\test_jit_setup.py ....
module\pypyjit\test\test_policy.py ............
module\pypyjit\test\test_pyframe.py .
module\pypyjit\test\test_ztranslation.py .
================================== FAILURES ===================================
__________________ AppTestJitHook.test_on_compile_exception ___________________
self = <CallInfo when='call' exception: CompilationError(out="""
""")>
func = <function <lambda> at 0x000001f723df3718>, when = 'call'
def __init__(self, func, when):
#: context of invocation: one of "setup", "call",
#: "teardown", "memocollect"
self.when = when
self.start = time()
try:
> self.result = func()
..\_pytest\runner.py:150:
_ _ _ _ _ _ _ _ _ _ _ _ _ _ _ _ _ _ _ _ _ _ _ _ _ _ _ _ _ _ _ _ _ _ _ _ _ _ _ _
> return CallInfo(lambda: ihook(item=item, **kwds), when=when)
..\_pytest\runner.py:138:
_ _ _ _ _ _ _ _ _ _ _ _ _ _ _ _ _ _ _ _ _ _ _ _ _ _ _ _ _ _ _ _ _ _ _ _ _ _ _ _
self = <_HookCaller 'pytest_runtest_call'>
kwargs = {'__multicall__': <_MultiCall 0 results, 1 meths, kwargs={'item': <AppTestMethod 'test_on_compile_exception'>, '__multicall__': <_MultiCall 0 results, 1 meths, kwargs={...}>}>, 'item': <AppTestMethod 'test_on_compile_exception'>}
def __call__(self, **kwargs):
assert not self.is_historic()
> return self._hookexec(self, self._nonwrappers + self._wrappers, kwargs)
..\_pytest\vendored_packages\pluggy.py:724:
_ _ _ _ _ _ _ _ _ _ _ _ _ _ _ _ _ _ _ _ _ _ _ _ _ _ _ _ _ _ _ _ _ _ _ _ _ _ _ _
self = <_pytest.config.PytestPluginManager object at 0x000001f71ee11670>
hook = <_HookCaller 'pytest_runtest_call'>
methods = [<_pytest.vendored_packages.pluggy.HookImpl instance at 0x000001f7207228e0>]
kwargs = {'__multicall__': <_MultiCall 0 results, 1 meths, kwargs={'item': <AppTestMethod 'test_on_compile_exception'>, '__multicall__': <_MultiCall 0 results, 1 meths, kwargs={...}>}>, 'item': <AppTestMethod 'test_on_compile_exception'>}
def _hookexec(self, hook, methods, kwargs):
# called from all hookcaller instances.
# enable_tracing will set its own wrapping function at self._inner_hookexec
> return self._inner_hookexec(hook, methods, kwargs)
..\_pytest\vendored_packages\pluggy.py:338:
_ _ _ _ _ _ _ _ _ _ _ _ _ _ _ _ _ _ _ _ _ _ _ _ _ _ _ _ _ _ _ _ _ _ _ _ _ _ _ _
hook = <_HookCaller 'pytest_runtest_call'>
methods = [<_pytest.vendored_packages.pluggy.HookImpl instance at 0x000001f7207228e0>]
kwargs = {'__multicall__': <_MultiCall 0 results, 1 meths, kwargs={'item': <AppTestMethod 'test_on_compile_exception'>, '__multicall__': <_MultiCall 0 results, 1 meths, kwargs={...}>}>, 'item': <AppTestMethod 'test_on_compile_exception'>}
self._inner_hookexec = lambda hook, methods, kwargs: \
> _MultiCall(methods, kwargs, hook.spec_opts).execute()
..\_pytest\vendored_packages\pluggy.py:333:
_ _ _ _ _ _ _ _ _ _ _ _ _ _ _ _ _ _ _ _ _ _ _ _ _ _ _ _ _ _ _ _ _ _ _ _ _ _ _ _
self = <_MultiCall 0 results, 1 meths, kwargs={'item': <AppTestMethod 'test_on_compile_exception'>, '__multicall__': <_MultiCall 0 results, 1 meths, kwargs={...}>}>
def execute(self):
all_kwargs = self.kwargs
self.results = results = []
firstresult = self.specopts.get("firstresult")
while self.hook_impls:
hook_impl = self.hook_impls.pop()
args = [all_kwargs[argname] for argname in hook_impl.argnames]
if hook_impl.hookwrapper:
> return _wrapped_call(hook_impl.function(*args), self.execute)
..\_pytest\vendored_packages\pluggy.py:595:
_ _ _ _ _ _ _ _ _ _ _ _ _ _ _ _ _ _ _ _ _ _ _ _ _ _ _ _ _ _ _ _ _ _ _ _ _ _ _ _
wrap_controller = <generator object pytest_runtest_call at 0x000001f723e25240>
func = <bound method _MultiCall.execute of <_MultiCall 0 results, 1 meths, kwargs={'i..._exception'>, '__multicall__': <_MultiCall 0 results, 1 meths, kwargs={...}>}>>
def _wrapped_call(wrap_controller, func):
""" Wrap calling to a function with a generator which needs to yield
exactly once. The yield point will trigger calling the wrapped function
and return its _CallOutcome to the yield point. The generator then needs
to finish (raise StopIteration) in order for the wrapped call to complete.
"""
try:
next(wrap_controller) # first yield
except StopIteration:
_raise_wrapfail(wrap_controller, "did not yield")
call_outcome = _CallOutcome(func)
try:
wrap_controller.send(call_outcome)
_raise_wrapfail(wrap_controller, "has second yield")
except StopIteration:
pass
> return call_outcome.get_result()
..\_pytest\vendored_packages\pluggy.py:253:
_ _ _ _ _ _ _ _ _ _ _ _ _ _ _ _ _ _ _ _ _ _ _ _ _ _ _ _ _ _ _ _ _ _ _ _ _ _ _ _
self = <_pytest.vendored_packages.pluggy._CallOutcome instance at 0x000001f723de5360>
def get_result(self):
if self.excinfo is None:
return self.result
else:
ex = self.excinfo
if _py3:
raise ex[1].with_traceback(ex[2])
> _reraise(*ex) # noqa
..\_pytest\vendored_packages\pluggy.py:279:
_ _ _ _ _ _ _ _ _ _ _ _ _ _ _ _ _ _ _ _ _ _ _ _ _ _ _ _ _ _ _ _ _ _ _ _ _ _ _ _
self = <_pytest.vendored_packages.pluggy._CallOutcome instance at 0x000001f723de5360>
func = <bound method _MultiCall.execute of <_MultiCall 0 results, 1 meths, kwargs={'i..._exception'>, '__multicall__': <_MultiCall 0 results, 1 meths, kwargs={...}>}>>
def __init__(self, func):
try:
> self.result = func()
..\_pytest\vendored_packages\pluggy.py:264:
_ _ _ _ _ _ _ _ _ _ _ _ _ _ _ _ _ _ _ _ _ _ _ _ _ _ _ _ _ _ _ _ _ _ _ _ _ _ _ _
self = <_MultiCall 0 results, 1 meths, kwargs={'item': <AppTestMethod 'test_on_compile_exception'>, '__multicall__': <_MultiCall 0 results, 1 meths, kwargs={...}>}>
def execute(self):
all_kwargs = self.kwargs
self.results = results = []
firstresult = self.specopts.get("firstresult")
while self.hook_impls:
hook_impl = self.hook_impls.pop()
args = [all_kwargs[argname] for argname in hook_impl.argnames]
if hook_impl.hookwrapper:
> return _wrapped_call(hook_impl.function(*args), self.execute)
..\_pytest\vendored_packages\pluggy.py:595:
_ _ _ _ _ _ _ _ _ _ _ _ _ _ _ _ _ _ _ _ _ _ _ _ _ _ _ _ _ _ _ _ _ _ _ _ _ _ _ _
wrap_controller = <generator object pytest_runtest_call at 0x000001f723e25178>
func = <bound method _MultiCall.execute of <_MultiCall 0 results, 1 meths, kwargs={'i..._exception'>, '__multicall__': <_MultiCall 0 results, 1 meths, kwargs={...}>}>>
def _wrapped_call(wrap_controller, func):
""" Wrap calling to a function with a generator which needs to yield
exactly once. The yield point will trigger calling the wrapped function
and return its _CallOutcome to the yield point. The generator then needs
to finish (raise StopIteration) in order for the wrapped call to complete.
"""
try:
next(wrap_controller) # first yield
except StopIteration:
_raise_wrapfail(wrap_controller, "did not yield")
call_outcome = _CallOutcome(func)
try:
wrap_controller.send(call_outcome)
_raise_wrapfail(wrap_controller, "has second yield")
except StopIteration:
pass
> return call_outcome.get_result()
..\_pytest\vendored_packages\pluggy.py:253:
_ _ _ _ _ _ _ _ _ _ _ _ _ _ _ _ _ _ _ _ _ _ _ _ _ _ _ _ _ _ _ _ _ _ _ _ _ _ _ _
self = <_pytest.vendored_packages.pluggy._CallOutcome instance at 0x000001f723de5320>
def get_result(self):
if self.excinfo is None:
return self.result
else:
ex = self.excinfo
if _py3:
raise ex[1].with_traceback(ex[2])
> _reraise(*ex) # noqa
..\_pytest\vendored_packages\pluggy.py:279:
_ _ _ _ _ _ _ _ _ _ _ _ _ _ _ _ _ _ _ _ _ _ _ _ _ _ _ _ _ _ _ _ _ _ _ _ _ _ _ _
self = <_pytest.vendored_packages.pluggy._CallOutcome instance at 0x000001f723de5320>
func = <bound method _MultiCall.execute of <_MultiCall 0 results, 1 meths, kwargs={'i..._exception'>, '__multicall__': <_MultiCall 0 results, 1 meths, kwargs={...}>}>>
def __init__(self, func):
try:
> self.result = func()
..\_pytest\vendored_packages\pluggy.py:264:
_ _ _ _ _ _ _ _ _ _ _ _ _ _ _ _ _ _ _ _ _ _ _ _ _ _ _ _ _ _ _ _ _ _ _ _ _ _ _ _
self = <_MultiCall 0 results, 1 meths, kwargs={'item': <AppTestMethod 'test_on_compile_exception'>, '__multicall__': <_MultiCall 0 results, 1 meths, kwargs={...}>}>
def execute(self):
all_kwargs = self.kwargs
self.results = results = []
firstresult = self.specopts.get("firstresult")
while self.hook_impls:
hook_impl = self.hook_impls.pop()
args = [all_kwargs[argname] for argname in hook_impl.argnames]
if hook_impl.hookwrapper:
return _wrapped_call(hook_impl.function(*args), self.execute)
> res = hook_impl.function(*args)
..\_pytest\vendored_packages\pluggy.py:596:
_ _ _ _ _ _ _ _ _ _ _ _ _ _ _ _ _ _ _ _ _ _ _ _ _ _ _ _ _ _ _ _ _ _ _ _ _ _ _ _
item = <AppTestMethod 'test_on_compile_exception'>
def pytest_runtest_call(item):
try:
> item.runtest()
..\_pytest\runner.py:91:
_ _ _ _ _ _ _ _ _ _ _ _ _ _ _ _ _ _ _ _ _ _ _ _ _ _ _ _ _ _ _ _ _ _ _ _ _ _ _ _
self = <AppTestMethod 'test_on_compile_exception'>
def runtest(self):
target = self.obj
if self.config.option.runappdirect:
return target()
space = target.im_self.space
filename = self._getdynfilename(target)
func = app2interp_temp(target.im_func, filename=filename)
w_instance = self.parent.w_instance
> self.execute_appex(space, func, space, w_instance)
tool\pytest\apptest.py:103:
_ _ _ _ _ _ _ _ _ _ _ _ _ _ _ _ _ _ _ _ _ _ _ _ _ _ _ _ _ _ _ _ _ _ _ _ _ _ _ _
self = <AppTestMethod 'test_on_compile_exception'>, space = StdObjSpace
target = <function test_on_compile_exception at 0x000001f723df3808>
args = (StdObjSpace, <pypy.interpreter.typedef.W_ObjectObjectUserDictWeakrefable object at 0x000001f723c5c1e0>)
def execute_appex(self, space, target, *args):
self.space = space
try:
> target(*args)
tool\pytest\apptest.py:44:
_ _ _ _ _ _ _ _ _ _ _ _ _ _ _ _ _ _ _ _ _ _ _ _ _ _ _ _ _ _ _ _ _ _ _ _ _ _ _ _
space = StdObjSpace
args_w = (<pypy.interpreter.typedef.W_ObjectObjectUserDictWeakrefable object at 0x000001f723c5c1e0>,)
w_func = <Function test_on_compile_exception>
args = <pypy.interpreter.typedef.W_ObjectObjectUserDictWeakrefable object at 0x000001f723c5c1e0>
def appcaller(space, *args_w):
if not isinstance(space, ObjSpace):
raise TypeError("first argument must be a space instance.")
# the last argument can be an Arguments
w_func = self.wget(space, name)
if not args_w:
return space.call_function(w_func)
else:
args = args_w[-1]
assert args is not None
if not isinstance(args, Arguments):
> return space.call_function(w_func, *args_w)
interpreter\gateway.py:1227:
_ _ _ _ _ _ _ _ _ _ _ _ _ _ _ _ _ _ _ _ _ _ _ _ _ _ _ _ _ _ _ _ _ _ _ _ _ _ _ _
self = StdObjSpace, w_func = <Function test_on_compile_exception>
args_w = (<pypy.interpreter.typedef.W_ObjectObjectUserDictWeakrefable object at 0x000001f723c5c1e0>,)
nargs = 1, Function = <class 'pypy.interpreter.function.Function'>
Method = <class 'pypy.interpreter.function.Method'>
def call_function(self, w_func, *args_w):
nargs = len(args_w) # used for pruning funccall versions
if not self.config.objspace.disable_call_speedhacks and nargs < 5:
# start of hack for performance
from pypy.interpreter.function import Function, Method
if isinstance(w_func, Method):
w_inst = w_func.w_instance
if w_inst is not None:
if nargs < 4:
func = w_func.w_function
if isinstance(func, Function):
return func.funccall(w_inst, *args_w)
elif args_w and (
self.abstract_isinstance_w(args_w[0], w_func.w_class)):
w_func = w_func.w_function
if isinstance(w_func, Function):
> return w_func.funccall(*args_w)
interpreter\baseobjspace.py:1210:
_ _ _ _ _ _ _ _ _ _ _ _ _ _ _ _ _ _ _ _ _ _ _ _ _ _ _ _ _ _ _ _ _ _ _ _ _ _ _ _
self = <Function test_on_compile_exception>
args_w = (<pypy.interpreter.typedef.W_ObjectObjectUserDictWeakrefable object at 0x000001f723c5c1e0>,)
gateway = <module 'pypy.interpreter.gateway' from 'd:\\pypy_stuff\\buildbot64\\slave\\own-win-x86-64\\build\\pypy\\interpreter\\gateway.pyc'>
PyCode = <class 'pypy.interpreter.pycode.PyCode'>
code = <code object test_on_compile_exception, file '[d:\pypy_stuff\buildbot64\slave\own-win-x86-64\build\pypy\module\pypyjit\test\test_jit_hook.py:174]', line 1>
def funccall(self, *args_w): # speed hack
from pypy.interpreter import gateway
from pypy.interpreter.pycode import PyCode
code = self.getcode() # hook for the jit
nargs = len(args_w)
fast_natural_arity = code.fast_natural_arity
if nargs == fast_natural_arity:
if nargs == 0:
assert isinstance(code, gateway.BuiltinCode0)
return code.fastcall_0(self.space, self)
elif nargs == 1:
assert isinstance(code, gateway.BuiltinCode1)
return code.fastcall_1(self.space, self, args_w[0])
elif nargs == 2:
assert isinstance(code, gateway.BuiltinCode2)
return code.fastcall_2(self.space, self, args_w[0], args_w[1])
elif nargs == 3:
assert isinstance(code, gateway.BuiltinCode3)
return code.fastcall_3(self.space, self, args_w[0],
args_w[1], args_w[2])
elif nargs == 4:
assert isinstance(code, gateway.BuiltinCode4)
return code.fastcall_4(self.space, self, args_w[0],
args_w[1], args_w[2], args_w[3])
elif (nargs | PyCode.FLATPYCALL) == fast_natural_arity:
assert isinstance(code, PyCode)
if nargs < 5:
new_frame = self.space.createframe(code, self.w_func_globals,
self)
for i in funccallunrolling:
if i < nargs:
new_frame.locals_cells_stack_w[i] = args_w[i]
> return new_frame.run()
interpreter\function.py:118:
_ _ _ _ _ _ _ _ _ _ _ _ _ _ _ _ _ _ _ _ _ _ _ _ _ _ _ _ _ _ _ _ _ _ _ _ _ _ _ _
self = <pypy.objspace.std.frame.StdObjSpaceFrame executing <code object test_on_compi...x86-64\build\pypy\module\pypyjit\test\test_jit_hook.py:174]', line 1> at line 9
def run(self):
"""Start this frame's execution."""
if self.getcode().co_flags & pycode.CO_GENERATOR:
from pypy.interpreter.generator import GeneratorIterator
return GeneratorIterator(self)
else:
> return self.execute_frame(None, None)
interpreter\pyframe.py:253:
_ _ _ _ _ _ _ _ _ _ _ _ _ _ _ _ _ _ _ _ _ _ _ _ _ _ _ _ _ _ _ _ _ _ _ _ _ _ _ _
self = <pypy.objspace.std.frame.StdObjSpaceFrame executing <code object test_on_compi...x86-64\build\pypy\module\pypyjit\test\test_jit_hook.py:174]', line 1> at line 9
w_inputvalue = None, operr = None
def execute_frame(self, w_inputvalue=None, operr=None):
"""Execute this frame. Main entry point to the interpreter.
The optional arguments are there to handle a generator's frame:
w_inputvalue is for generator.send() and operr is for
generator.throw().
"""
# the following 'assert' is an annotation hint: it hides from
# the annotator all methods that are defined in PyFrame but
# overridden in the {,Host}FrameClass subclasses of PyFrame.
assert (isinstance(self, self.space.FrameClass) or
not self.space.config.translating)
executioncontext = self.space.getexecutioncontext()
executioncontext.enter(self)
got_exception = True
w_exitvalue = self.space.w_None
try:
executioncontext.call_trace(self)
#
try:
if operr is not None:
next_instr = self.handle_operation_error(
executioncontext, operr)
self.last_instr = intmask(next_instr - 1)
else:
# Execution starts just after the last_instr. Initially,
# last_instr is -1. After a generator suspends it points to
# the YIELD_VALUE instruction.
next_instr = r_uint(self.last_instr + 1)
if next_instr != 0:
self.pushvalue(w_inputvalue)
w_exitvalue = self.dispatch(self.pycode, next_instr,
executioncontext)
except OperationError:
raise
except Exception as e: # general fall-back
> raise self._convert_unexpected_exception(e)
interpreter\pyframe.py:290:
_ _ _ _ _ _ _ _ _ _ _ _ _ _ _ _ _ _ _ _ _ _ _ _ _ _ _ _ _ _ _ _ _ _ _ _ _ _ _ _
self = <pypy.objspace.std.frame.StdObjSpaceFrame executing <code object test_on_compi...x86-64\build\pypy\module\pypyjit\test\test_jit_hook.py:174]', line 1> at line 9
e = CompilationError(out="""
""")
def _convert_unexpected_exception(self, e):
from pypy.interpreter import error
> operr = error.get_converted_unexpected_exception(self.space, e)
interpreter\pyframe.py:943:
_ _ _ _ _ _ _ _ _ _ _ _ _ _ _ _ _ _ _ _ _ _ _ _ _ _ _ _ _ _ _ _ _ _ _ _ _ _ _ _
self = <pypy.objspace.std.frame.StdObjSpaceFrame executing <code object test_on_compi...x86-64\build\pypy\module\pypyjit\test\test_jit_hook.py:174]', line 1> at line 9
w_inputvalue = None, operr = None
def execute_frame(self, w_inputvalue=None, operr=None):
"""Execute this frame. Main entry point to the interpreter.
The optional arguments are there to handle a generator's frame:
w_inputvalue is for generator.send() and operr is for
generator.throw().
"""
# the following 'assert' is an annotation hint: it hides from
# the annotator all methods that are defined in PyFrame but
# overridden in the {,Host}FrameClass subclasses of PyFrame.
assert (isinstance(self, self.space.FrameClass) or
not self.space.config.translating)
executioncontext = self.space.getexecutioncontext()
executioncontext.enter(self)
got_exception = True
w_exitvalue = self.space.w_None
try:
executioncontext.call_trace(self)
#
try:
if operr is not None:
next_instr = self.handle_operation_error(
executioncontext, operr)
self.last_instr = intmask(next_instr - 1)
else:
# Execution starts just after the last_instr. Initially,
# last_instr is -1. After a generator suspends it points to
# the YIELD_VALUE instruction.
next_instr = r_uint(self.last_instr + 1)
if next_instr != 0:
self.pushvalue(w_inputvalue)
w_exitvalue = self.dispatch(self.pycode, next_instr,
> executioncontext)
interpreter\pyframe.py:286:
_ _ _ _ _ _ _ _ _ _ _ _ _ _ _ _ _ _ _ _ _ _ _ _ _ _ _ _ _ _ _ _ _ _ _ _ _ _ _ _
self = <pypy.objspace.std.frame.StdObjSpaceFrame executing <code object test_on_compi...x86-64\build\pypy\module\pypyjit\test\test_jit_hook.py:174]', line 1> at line 9
pycode = <code object test_on_compile_exception, file '[d:\pypy_stuff\buildbot64\slave\own-win-x86-64\build\pypy\module\pypyjit\test\test_jit_hook.py:174]', line 1>
next_instr = 0L
ec = <pypy.interpreter.executioncontext.ExecutionContext object at 0x000001f723aff018>
def dispatch(self, pycode, next_instr, ec):
self = hint(self, access_directly=True)
next_instr = r_uint(next_instr)
is_being_profiled = self.get_is_being_profiled()
try:
while True:
pypyjitdriver.jit_merge_point(ec=ec,
frame=self, next_instr=next_instr, pycode=pycode,
is_being_profiled=is_being_profiled)
co_code = pycode.co_code
self.valuestackdepth = hint(self.valuestackdepth, promote=True)
> next_instr = self.handle_bytecode(co_code, next_instr, ec)
module\pypyjit\interp_jit.py:90:
_ _ _ _ _ _ _ _ _ _ _ _ _ _ _ _ _ _ _ _ _ _ _ _ _ _ _ _ _ _ _ _ _ _ _ _ _ _ _ _
self = <pypy.objspace.std.frame.StdObjSpaceFrame executing <code object test_on_compi...x86-64\build\pypy\module\pypyjit\test\test_jit_hook.py:174]', line 1> at line 9
co_code = 'd\x01\x00d\x00\x00l\x00\x00}\x01\x00d\x01\x00d\x00\x00l\x01\x00}\x02\x00d\x01\x00d\x00\x00l\x02\x00}\x03\x00d\x02\x00...x00\x82\x01\x00\xcc\x18\x00d\x04\x00|\x05\x00\xc9\x07\x00\xca\x00\x00k\x06\x00s\xa9\x00t\x08\x00\x82\x01\x00d\x00\x00S'
next_instr = 0L
ec = <pypy.interpreter.executioncontext.ExecutionContext object at 0x000001f723aff018>
def handle_bytecode(self, co_code, next_instr, ec):
try:
> next_instr = self.dispatch_bytecode(co_code, next_instr, ec)
interpreter\pyopcode.py:71:
_ _ _ _ _ _ _ _ _ _ _ _ _ _ _ _ _ _ _ _ _ _ _ _ _ _ _ _ _ _ _ _ _ _ _ _ _ _ _ _
self = <pypy.objspace.std.frame.StdObjSpaceFrame executing <code object test_on_compi...x86-64\build\pypy\module\pypyjit\test\test_jit_hook.py:174]', line 1> at line 9
co_code = 'd\x01\x00d\x00\x00l\x00\x00}\x01\x00d\x01\x00d\x00\x00l\x01\x00}\x02\x00d\x01\x00d\x00\x00l\x02\x00}\x03\x00d\x02\x00...x00\x82\x01\x00\xcc\x18\x00d\x04\x00|\x05\x00\xc9\x07\x00\xca\x00\x00k\x06\x00s\xa9\x00t\x08\x00\x82\x01\x00d\x00\x00S'
next_instr = 76L
ec = <pypy.interpreter.executioncontext.ExecutionContext object at 0x000001f723aff018>
@jit.unroll_safe
def dispatch_bytecode(self, co_code, next_instr, ec):
while True:
self.last_instr = intmask(next_instr)
if jit.we_are_jitted():
if self.debugdata:
ec.bytecode_only_trace(self)
next_instr = r_uint(self.last_instr)
else:
# Only reload next_instr from last_instr when something that
# can modify it actually ran (trace function or action
# dispatcher). In the common case (no trace, positive ticker)
# next_instr is unchanged and the round-trip is skipped.
_d = self.debugdata
if ec.space.reverse_debugging or (
_d is not None and _d.w_f_trace is not None) or (
not we_are_translated() and
'bytecode_only_trace' in ec.__dict__):
ec.bytecode_only_trace(self)
next_instr = r_uint(self.last_instr)
actionflag = ec.space.actionflag
if actionflag.decrement_ticker(TICK_COUNTER_STEP) < 0:
actionflag.action_dispatcher(ec, self)
next_instr = r_uint(self.last_instr)
opcode = ord(co_code[next_instr])
next_instr += 1
if opcode >= HAVE_ARGUMENT:
lo = ord(co_code[next_instr])
hi = ord(co_code[next_instr+1])
next_instr += 2
oparg = (hi * 256) | lo
else:
oparg = 0
# note: the structure of the code here is such that it makes
# (after translation) a big "if/elif" chain, which is then
# turned into a switch().
while opcode == opcodedesc.EXTENDED_ARG.index:
opcode = ord(co_code[next_instr])
if opcode < HAVE_ARGUMENT:
raise BytecodeCorruption
lo = ord(co_code[next_instr+1])
hi = ord(co_code[next_instr+2])
next_instr += 3
oparg = (oparg * 65536) | (hi * 256) | lo
if opcode == opcodedesc.RETURN_VALUE.index:
if not self.blockstack_non_empty():
self.frame_finished_execution = True # for generators
raise Return
w_returnvalue = self.popvalue()
block = self.unrollstack(SReturnValue.kind)
if block is None:
self.pushvalue(w_returnvalue)
raise Return
else:
unroller = SReturnValue(w_returnvalue)
next_instr = block.handle(self, unroller)
return next_instr # now inside a 'finally' block
elif opcode == opcodedesc.END_FINALLY.index:
unroller = self.end_finally()
if isinstance(unroller, SuspendedUnroller):
# go on unrolling the stack
block = self.unrollstack(unroller.kind)
if block is None:
w_result = unroller.nomoreblocks()
self.pushvalue(w_result)
raise Return
else:
next_instr = block.handle(self, unroller)
return next_instr
elif opcode == opcodedesc.JUMP_ABSOLUTE.index:
return self.jump_absolute(oparg, ec)
elif opcode == opcodedesc.BREAK_LOOP.index:
next_instr = self.BREAK_LOOP(oparg, next_instr)
elif opcode == opcodedesc.CONTINUE_LOOP.index:
return self.CONTINUE_LOOP(oparg, next_instr)
elif opcode == opcodedesc.FOR_ITER.index:
next_instr = self.FOR_ITER(oparg, next_instr)
elif opcode == opcodedesc.JUMP_FORWARD.index:
next_instr = self.JUMP_FORWARD(oparg, next_instr)
elif opcode == opcodedesc.JUMP_IF_FALSE_OR_POP.index:
next_instr = self.JUMP_IF_FALSE_OR_POP(oparg, next_instr)
elif opcode == opcodedesc.JUMP_IF_NOT_DEBUG.index:
next_instr = self.JUMP_IF_NOT_DEBUG(oparg, next_instr)
elif opcode == opcodedesc.JUMP_IF_TRUE_OR_POP.index:
next_instr = self.JUMP_IF_TRUE_OR_POP(oparg, next_instr)
elif opcode == opcodedesc.POP_JUMP_IF_FALSE.index:
next_instr = self.POP_JUMP_IF_FALSE(oparg, next_instr)
elif opcode == opcodedesc.POP_JUMP_IF_TRUE.index:
next_instr = self.POP_JUMP_IF_TRUE(oparg, next_instr)
elif opcode == opcodedesc.BINARY_ADD.index:
self.BINARY_ADD(oparg, next_instr)
elif opcode == opcodedesc.BINARY_AND.index:
self.BINARY_AND(oparg, next_instr)
elif opcode == opcodedesc.BINARY_DIVIDE.index:
self.BINARY_DIVIDE(oparg, next_instr)
elif opcode == opcodedesc.BINARY_FLOOR_DIVIDE.index:
self.BINARY_FLOOR_DIVIDE(oparg, next_instr)
elif opcode == opcodedesc.BINARY_LSHIFT.index:
self.BINARY_LSHIFT(oparg, next_instr)
elif opcode == opcodedesc.BINARY_MODULO.index:
self.BINARY_MODULO(oparg, next_instr)
elif opcode == opcodedesc.BINARY_MULTIPLY.index:
self.BINARY_MULTIPLY(oparg, next_instr)
elif opcode == opcodedesc.BINARY_OR.index:
self.BINARY_OR(oparg, next_instr)
elif opcode == opcodedesc.BINARY_POWER.index:
self.BINARY_POWER(oparg, next_instr)
elif opcode == opcodedesc.BINARY_RSHIFT.index:
self.BINARY_RSHIFT(oparg, next_instr)
elif opcode == opcodedesc.BINARY_SUBSCR.index:
self.BINARY_SUBSCR(oparg, next_instr)
elif opcode == opcodedesc.BINARY_SUBTRACT.index:
self.BINARY_SUBTRACT(oparg, next_instr)
elif opcode == opcodedesc.BINARY_TRUE_DIVIDE.index:
self.BINARY_TRUE_DIVIDE(oparg, next_instr)
elif opcode == opcodedesc.BINARY_XOR.index:
self.BINARY_XOR(oparg, next_instr)
elif opcode == opcodedesc.BUILD_CLASS.index:
self.BUILD_CLASS(oparg, next_instr)
elif opcode == opcodedesc.BUILD_LIST.index:
self.BUILD_LIST(oparg, next_instr)
elif opcode == opcodedesc.BUILD_LIST_FROM_ARG.index:
self.BUILD_LIST_FROM_ARG(oparg, next_instr)
elif opcode == opcodedesc.BUILD_MAP.index:
self.BUILD_MAP(oparg, next_instr)
elif opcode == opcodedesc.BUILD_SET.index:
self.BUILD_SET(oparg, next_instr)
elif opcode == opcodedesc.BUILD_SLICE.index:
self.BUILD_SLICE(oparg, next_instr)
elif opcode == opcodedesc.BUILD_TUPLE.index:
self.BUILD_TUPLE(oparg, next_instr)
elif opcode == opcodedesc.CALL_FUNCTION.index:
self.CALL_FUNCTION(oparg, next_instr)
elif opcode == opcodedesc.CALL_FUNCTION_KW.index:
self.CALL_FUNCTION_KW(oparg, next_instr)
elif opcode == opcodedesc.CALL_FUNCTION_VAR.index:
self.CALL_FUNCTION_VAR(oparg, next_instr)
elif opcode == opcodedesc.CALL_FUNCTION_VAR_KW.index:
self.CALL_FUNCTION_VAR_KW(oparg, next_instr)
elif opcode == opcodedesc.CALL_METHOD.index:
self.CALL_METHOD(oparg, next_instr)
elif opcode == opcodedesc.COMPARE_OP.index:
self.COMPARE_OP(oparg, next_instr)
elif opcode == opcodedesc.DELETE_ATTR.index:
self.DELETE_ATTR(oparg, next_instr)
elif opcode == opcodedesc.DELETE_FAST.index:
self.DELETE_FAST(oparg, next_instr)
elif opcode == opcodedesc.DELETE_GLOBAL.index:
self.DELETE_GLOBAL(oparg, next_instr)
elif opcode == opcodedesc.DELETE_NAME.index:
self.DELETE_NAME(oparg, next_instr)
elif opcode == opcodedesc.DELETE_SLICE_0.index:
self.DELETE_SLICE_0(oparg, next_instr)
elif opcode == opcodedesc.DELETE_SLICE_1.index:
self.DELETE_SLICE_1(oparg, next_instr)
elif opcode == opcodedesc.DELETE_SLICE_2.index:
self.DELETE_SLICE_2(oparg, next_instr)
elif opcode == opcodedesc.DELETE_SLICE_3.index:
self.DELETE_SLICE_3(oparg, next_instr)
elif opcode == opcodedesc.DELETE_SUBSCR.index:
self.DELETE_SUBSCR(oparg, next_instr)
elif opcode == opcodedesc.DUP_TOP.index:
self.DUP_TOP(oparg, next_instr)
elif opcode == opcodedesc.DUP_TOPX.index:
self.DUP_TOPX(oparg, next_instr)
elif opcode == opcodedesc.EXEC_STMT.index:
self.EXEC_STMT(oparg, next_instr)
elif opcode == opcodedesc.GET_ITER.index:
self.GET_ITER(oparg, next_instr)
elif opcode == opcodedesc.IMPORT_FROM.index:
self.IMPORT_FROM(oparg, next_instr)
elif opcode == opcodedesc.IMPORT_NAME.index:
self.IMPORT_NAME(oparg, next_instr)
elif opcode == opcodedesc.IMPORT_STAR.index:
self.IMPORT_STAR(oparg, next_instr)
elif opcode == opcodedesc.INPLACE_ADD.index:
self.INPLACE_ADD(oparg, next_instr)
elif opcode == opcodedesc.INPLACE_AND.index:
self.INPLACE_AND(oparg, next_instr)
elif opcode == opcodedesc.INPLACE_DIVIDE.index:
self.INPLACE_DIVIDE(oparg, next_instr)
elif opcode == opcodedesc.INPLACE_FLOOR_DIVIDE.index:
self.INPLACE_FLOOR_DIVIDE(oparg, next_instr)
elif opcode == opcodedesc.INPLACE_LSHIFT.index:
self.INPLACE_LSHIFT(oparg, next_instr)
elif opcode == opcodedesc.INPLACE_MODULO.index:
self.INPLACE_MODULO(oparg, next_instr)
elif opcode == opcodedesc.INPLACE_MULTIPLY.index:
self.INPLACE_MULTIPLY(oparg, next_instr)
elif opcode == opcodedesc.INPLACE_OR.index:
self.INPLACE_OR(oparg, next_instr)
elif opcode == opcodedesc.INPLACE_POWER.index:
self.INPLACE_POWER(oparg, next_instr)
elif opcode == opcodedesc.INPLACE_RSHIFT.index:
self.INPLACE_RSHIFT(oparg, next_instr)
elif opcode == opcodedesc.INPLACE_SUBTRACT.index:
self.INPLACE_SUBTRACT(oparg, next_instr)
elif opcode == opcodedesc.INPLACE_TRUE_DIVIDE.index:
self.INPLACE_TRUE_DIVIDE(oparg, next_instr)
elif opcode == opcodedesc.INPLACE_XOR.index:
self.INPLACE_XOR(oparg, next_instr)
elif opcode == opcodedesc.LIST_APPEND.index:
self.LIST_APPEND(oparg, next_instr)
elif opcode == opcodedesc.LOAD_ATTR.index:
> self.LOAD_ATTR(oparg, next_instr)
interpreter\pyopcode.py:354:
_ _ _ _ _ _ _ _ _ _ _ _ _ _ _ _ _ _ _ _ _ _ _ _ _ _ _ _ _ _ _ _ _ _ _ _ _ _ _ _
self = <pypy.objspace.std.frame.StdObjSpaceFrame executing <code object test_on_compi...x86-64\build\pypy\module\pypyjit\test\test_jit_hook.py:174]', line 1> at line 9
nameindex = 5, next_instr = 76L
@always_inline
def LOAD_ATTR(self, nameindex, next_instr):
"obj.attributename"
w_obj = self.popvalue()
if not jit.we_are_jitted():
from pypy.objspace.std.mapdict import LOAD_ATTR_caching
> w_value = LOAD_ATTR_caching(self.getcode(), w_obj, nameindex)
interpreter\pyopcode.py:991:
_ _ _ _ _ _ _ _ _ _ _ _ _ _ _ _ _ _ _ _ _ _ _ _ _ _ _ _ _ _ _ _ _ _ _ _ _ _ _ _
pycode = <code object test_on_compile_exception, file '[d:\pypy_stuff\buildbot64\slave\own-win-x86-64\build\pypy\module\pypyjit\test\test_jit_hook.py:174]', line 1>
w_obj = <pypy.module.sys.moduledef.Module object at 0x000001f72174acd0>
nameindex = 5
@objectmodel.always_inline
def LOAD_ATTR_caching(pycode, w_obj, nameindex):
# this whole mess is to make the interpreter quite a bit faster; it's not
# used if we_are_jitted().
entry = pycode._mapdict_caches[nameindex]
map = w_obj._get_mapdict_map()
if entry.is_valid_for_map(map) and entry.w_method is None:
# everything matches, it's incredibly fast
attr = entry.attr_wref()
if attr is not None:
return attr._direct_read(w_obj)
> return LOAD_ATTR_slowpath(pycode, w_obj, nameindex, map)
objspace\std\mapdict.py:1420:
_ _ _ _ _ _ _ _ _ _ _ _ _ _ _ _ _ _ _ _ _ _ _ _ _ _ _ _ _ _ _ _ _ _ _ _ _ _ _ _
pycode = <code object test_on_compile_exception, file '[d:\pypy_stuff\buildbot64\slave\own-win-x86-64\build\pypy\module\pypyjit\test\test_jit_hook.py:174]', line 1>
w_obj = <pypy.module.sys.moduledef.Module object at 0x000001f72174acd0>
nameindex = 5, map = None
@objectmodel.dont_inline
def LOAD_ATTR_slowpath(pycode, w_obj, nameindex, map):
space = pycode.space
w_name = pycode.co_names_w[nameindex]
if map is not None:
w_type = map.terminator.w_cls
w_descr = w_type.getattribute_if_not_from_object()
if w_descr is not None:
return space._handle_getattribute(w_descr, w_obj, w_name)
version_tag = w_type.version_tag()
if version_tag is not None:
name = space.text_w(w_name)
# We need to care for obscure cases in which the w_descr is
# a MutableCell, which may change without changing the version_tag
_, w_descr = w_type._pure_lookup_where_with_method_cache(
name, version_tag)
#
attrname, attrkind = ("", INVALID)
if w_descr is None:
attrname, attrkind = (name, DICT) # common case: no such attr in the class
elif isinstance(w_descr, MutableCell):
pass # we have a MutableCell in the class: give up
elif space.is_data_descr(w_descr):
# we have a data descriptor, which means the dictionary value
# (if any) has no relevance.
from pypy.interpreter.typedef import Member
if isinstance(w_descr, Member): # it is a slot -- easy case
attrname, attrkind = ("slot", SLOTS_STARTING_FROM + w_descr.index)
elif not space.type(w_descr).is_heaptype():
# There is a non-data descriptor in the class. This would mean
# we use the dict entry, however, the class of w_descr could be
# changed to add a __get__/__set__ without the cache noticing,
# so we can only use the cache if w_descr is an instance of an
# immutable type. see
# test_load_attr_bug_class_name_turns_into_descriptor
attrname = name
attrkind = DICT
#
if attrkind != INVALID:
attr = map.find_map_attr(attrname, attrkind)
if attr is not None:
# Note that if map.terminator is a DevolvedDictTerminator
# or the class provides its own dict, not using mapdict, then:
# map.find_map_attr will always return None if attrkind==DICT.
_fill_cache(pycode, nameindex, map, version_tag, attr,
valid_for_store=w_type.setattr_if_not_from_object() is None)
return attr._direct_read(w_obj)
if space.config.objspace.std.withmethodcachecounter:
INVALID_CACHE_ENTRY.failure_counter += 1
> return space.getattr(w_obj, w_name)
objspace\std\mapdict.py:1471:
_ _ _ _ _ _ _ _ _ _ _ _ _ _ _ _ _ _ _ _ _ _ _ _ _ _ _ _ _ _ _ _ _ _ _ _ _ _ _ _
self = StdObjSpace
w_obj = <pypy.module.sys.moduledef.Module object at 0x000001f72174acd0>
w_name = W_BytesObject('stderr')
def getattr(self, w_obj, w_name):
# an optional shortcut for performance
w_type = self.type(w_obj)
w_descr = w_type.getattribute_if_not_from_object()
if w_descr is not None:
return self._handle_getattribute(w_descr, w_obj, w_name)
# fast path: XXX this is duplicating most of the logic
# from the default __getattribute__ and the getattr() method...
name = self.text_w(w_name)
w_descr = w_type.lookup(name)
e = None
if w_descr is not None:
w_get = None
is_data = self.is_data_descr(w_descr)
if is_data:
w_get = self.lookup(w_descr, "__get__")
if w_get is None:
w_value = w_obj.getdictvalue(self, name)
if w_value is not None:
return w_value
if not is_data:
w_get = self.lookup(w_descr, "__get__")
if w_get is not None:
# __get__ is allowed to raise an AttributeError to trigger
# use of __getattr__.
try:
return self.get_and_call_function(w_get, w_descr, w_obj,
w_type)
except OperationError as e:
if not e.match(self, self.w_AttributeError):
raise
else:
return w_descr
else:
> w_value = w_obj.getdictvalue(self, name)
objspace\std\objspace.py:655:
_ _ _ _ _ _ _ _ _ _ _ _ _ _ _ _ _ _ _ _ _ _ _ _ _ _ _ _ _ _ _ _ _ _ _ _ _ _ _ _
self = <pypy.module.sys.moduledef.Module object at 0x000001f72174acd0>
space = StdObjSpace, attr = 'stderr'
def getdictvalue(self, space, attr):
""" specialize access to dynamic exc_* attributes. """
> value = MixedModule.getdictvalue(self, space, attr)
module\sys\moduledef.py:145:
_ _ _ _ _ _ _ _ _ _ _ _ _ _ _ _ _ _ _ _ _ _ _ _ _ _ _ _ _ _ _ _ _ _ _ _ _ _ _ _
self = <pypy.module.sys.moduledef.Module object at 0x000001f72174acd0>
space = StdObjSpace, name = 'stderr'
def getdictvalue(self, space, name):
w_value = space.finditem_str(self.w_dict, name)
if self.lazy and w_value is None:
> return self._load_lazily(space, name)
interpreter\mixedmodule.py:93:
_ _ _ _ _ _ _ _ _ _ _ _ _ _ _ _ _ _ _ _ _ _ _ _ _ _ _ _ _ _ _ _ _ _ _ _ _ _ _ _
self = <pypy.module.sys.moduledef.Module object at 0x000001f72174acd0>
space = StdObjSpace, name = 'stderr'
def _load_lazily(self, space, name):
w_name = space.new_interned_str(name)
try:
loader = self.loaders[name]
except KeyError:
return None
else:
> w_value = loader(space)
interpreter\mixedmodule.py:103:
_ _ _ _ _ _ _ _ _ _ _ _ _ _ _ _ _ _ _ _ _ _ _ _ _ _ _ _ _ _ _ _ _ _ _ _ _ _ _ _
space = StdObjSpace
def ifileloader(space):
d = {'space':space}
# EVIL HACK (but it works, and this is not RPython :-)
while 1:
try:
> value = eval(spec, d)
interpreter\mixedmodule.py:176:
_ _ _ _ _ _ _ _ _ _ _ _ _ _ _ _ _ _ _ _ _ _ _ _ _ _ _ _ _ _ _ _ _ _ _ _ _ _ _ _
> ???
<string>:1:
_ _ _ _ _ _ _ _ _ _ _ _ _ _ _ _ _ _ _ _ _ _ _ _ _ _ _ _ _ _ _ _ _ _ _ _ _ _ _ _
space = StdObjSpace
def getio(space):
> return space.fromcache(IOState)
module\sys\state.py:57:
_ _ _ _ _ _ _ _ _ _ _ _ _ _ _ _ _ _ _ _ _ _ _ _ _ _ _ _ _ _ _ _ _ _ _ _ _ _ _ _
self = <Cache 'InternalSpaceCache' (24 items)>
key = <class pypy.module.sys.state.IOState at 0x000001f7236ec3d8>
def getorbuild(self, key):
if lock: lock.acquire()
try:
try:
return self.content[key]
except KeyError:
if key in self._building:
raise RuntimeError("%s recursive building of %r" %
(self, key))
self._building[key] = True
try:
> result = self._build(key)
..\rpython\rlib\cache.py:51:
_ _ _ _ _ _ _ _ _ _ _ _ _ _ _ _ _ _ _ _ _ _ _ _ _ _ _ _ _ _ _ _ _ _ _ _ _ _ _ _
self = <Cache 'InternalSpaceCache' (24 items)>
callable = <class pypy.module.sys.state.IOState at 0x000001f7236ec3d8>
def _build(self, callable):
> return callable(self.space)
interpreter\baseobjspace.py:402:
_ _ _ _ _ _ _ _ _ _ _ _ _ _ _ _ _ _ _ _ _ _ _ _ _ _ _ _ _ _ _ _ _ _ _ _ _ _ _ _
self = <pypy.module.sys.state.IOState instance at 0x000001f723f5e6e0>
space = StdObjSpace
def __init__(self, space):
from pypy.module._file.interp_file import W_File
self.space = space
w_stdin = W_File(space)
> w_stdin.file_fdopen(0, "r", 1)
module\sys\state.py:40:
_ _ _ _ _ _ _ _ _ _ _ _ _ _ _ _ _ _ _ _ _ _ _ _ _ _ _ _ _ _ _ _ _ _ _ _ _ _ _ _
self = <pypy.module._file.interp_file.W_File object at 0x000001f723f77bb0>
fd = 0, mode = 'r', buffering = 1
def file_fdopen(self, fd, mode="r", buffering=-1):
try:
> self.direct_fdopen(fd, mode, buffering)
module\_file\interp_file.py:329:
_ _ _ _ _ _ _ _ _ _ _ _ _ _ _ _ _ _ _ _ _ _ _ _ _ _ _ _ _ _ _ _ _ _ _ _ _ _ _ _
self = <pypy.module._file.interp_file.W_File object at 0x000001f723f77bb0>
fd = 0, mode = 'r', buffering = 1
def direct_fdopen(self, fd, mode='r', buffering=-1):
self.direct_close()
self.w_name = self.space.newtext('<fdopen>')
self.check_mode_ok(mode)
stream = streamio.fdopen_as_stream(fd, mode, buffering,
> signal_checker(self.space))
module\_file\interp_file.py:165:
_ _ _ _ _ _ _ _ _ _ _ _ _ _ _ _ _ _ _ _ _ _ _ _ _ _ _ _ _ _ _ _ _ _ _ _ _ _ _ _
fd = 0, mode = 'r', buffering = 1
signal_checker = <function checksignals at 0x000001f723f60b60>
def fdopen_as_stream(fd, mode, buffering=-1, signal_checker=None):
os_flags, universal, reading, writing, basemode, binary = decode_mode(mode)
_check_fd_mode(fd, reading, writing)
> _setfd_binary(fd)
..\rpython\rlib\streamio.py:115:
_ _ _ _ _ _ _ _ _ _ _ _ _ _ _ _ _ _ _ _ _ _ _ _ _ _ _ _ _ _ _ _ _ _ _ _ _ _ _ _
fd = 0
def _setfd_binary(fd):
# Allow this to succeed on invalid fd's
> with rposix.SuppressIPH():
..\rpython\rlib\streamio.py:212:
_ _ _ _ _ _ _ _ _ _ _ _ _ _ _ _ _ _ _ _ _ _ _ _ _ _ _ _ _ _ _ _ _ _ _ _ _ _ _ _
self = <rpython.rlib.rposix.SuppressIPH object at 0x000001f723f77da8>
def __enter__(self):
> self.invalid_param_hndlr = c_enter_suppress_iph()
..\rpython\rlib\rposix.py:259:
_ _ _ _ _ _ _ _ _ _ _ _ _ _ _ _ _ _ _ _ _ _ _ _ _ _ _ _ _ _ _ _ _ _ _ _ _ _ _ _
args = (), real_args = (), to_free = ()
def wrapper(*args):
assert len(args) == nb_args
real_args = ()
# XXX 'to_free' leaks if an allocation fails with MemoryError
# and was not the first in this function
to_free = ()
for i, TARGET in unrolling_arg_tps:
arg = args[i]
if TARGET == CCHARP or TARGET is VOIDP:
if arg is None:
from rpython.rtyper.annlowlevel import llstr
arg = lltype.nullptr(CCHARP.TO) # None => (char*)NULL
to_free = to_free + (arg, llstr(None), '\x04')
elif isinstance(arg, str):
tup = get_nonmovingbuffer_ll_final_null(arg)
to_free = to_free + tup
arg = tup[0]
elif isinstance(arg, unicode):
_oops()
elif TARGET == CWCHARP:
if arg is None:
arg = lltype.nullptr(CWCHARP.TO) # None => (wchar_t*)NULL
to_free = to_free + (arg,)
elif isinstance(arg, unicode):
arg = unicode2wcharp(arg)
to_free = to_free + (arg,)
elif _isfunctype(TARGET) and not _isllptr(arg):
# XXX pass additional arguments
use_gil = invoke_around_handlers
arg = llhelper(TARGET, _make_wrapper_for(TARGET, arg,
callbackholder,
use_gil))
else:
SOURCE = lltype.typeOf(arg)
if SOURCE != TARGET:
if TARGET is lltype.Float:
arg = float(arg)
elif ((isinstance(SOURCE, lltype.Number)
or SOURCE is lltype.Bool)
and (isinstance(TARGET, lltype.Number)
or TARGET is lltype.Bool)):
arg = cast(TARGET, arg)
real_args = real_args + (arg,)
> res = call_external_function(*real_args)
..\rpython\rtyper\lltypesystem\rffi.py:321:
_ _ _ _ _ _ _ _ _ _ _ _ _ _ _ _ _ _ _ _ _ _ _ _ _ _ _ _ _ _ _ _ _ _ _ _ _ _ _ _
def call_external_function():
rgil.release()
# NB. it is essential that no exception checking occurs here!
if 0:
from rpython.rlib import rposix
rposix._errno_before(0)
if we_are_translated():
res = funcptr()
else:
try: # only when non-translated
> res = funcptr()
<92-codegen d:\pypy_stuff\buildbot64\slave\own-win-x86-64\build\rpython\rtyper\lltypesystem\rffi.py:217>:13:
_ _ _ _ _ _ _ _ _ _ _ _ _ _ _ _ _ _ _ _ _ _ _ _ _ _ _ _ _ _ _ _ _ _ _ _ _ _ _ _
self = <* fn enter_suppress_iph>, args = ()
rffi = <module 'rpython.rtyper.lltypesystem.rffi' from 'd:\\pypy_stuff\\buildbot64\\slave\\own-win-x86-64\\build\\rpython\\rtyper\\lltypesystem\\rffi.pyc'>
def __call__(self, *args):
from rpython.rtyper.lltypesystem import rffi
if isinstance(self._T, FuncType):
if len(args) != len(self._T.ARGS):
raise TypeError("calling %r with wrong argument number: %r" %
(self._T, args))
for i, a, ARG in zip(range(len(self._T.ARGS)), args, self._T.ARGS):
if typeOf(a) != ARG:
# ARG could be Void
if ARG == Void:
try:
value = getattr(self._obj, '_void' + str(i))
except AttributeError:
pass
else:
assert a == value
# None is acceptable for any pointer
elif isinstance(ARG, Ptr) and a is None:
pass
# Any pointer is convertible to void*
elif ARG is rffi.VOIDP and isinstance(typeOf(a), Ptr):
pass
# special case: ARG can be a container type, in which
# case a should be a pointer to it. This must also be
# special-cased in the backends.
elif (isinstance(ARG, ContainerType) and
typeOf(a) == Ptr(ARG)):
pass
else:
args_repr = [typeOf(arg) for arg in args]
raise TypeError("calling %r with wrong argument "
"types: %r" % (self._T, args_repr))
callb = self._obj._callable
if callb is None:
raise RuntimeError("calling undefined function")
> return callb(*args)
..\rpython\rtyper\lltypesystem\lltype.py:1384:
_ _ _ _ _ _ _ _ _ _ _ _ _ _ _ _ _ _ _ _ _ _ _ _ _ _ _ _ _ _ _ _ _ _ _ _ _ _ _ _
self = <rpython.rtyper.lltypesystem.ll2ctypes.LL2CtypesCallable object at 0x000001f71f03d4e8>
argvalues = ()
def __call__(self, *argvalues):
with rlock:
if self.trampoline is None:
# lazily build the corresponding ctypes function object
cfunc = get_ctypes_callable(self.funcptr, self.calling_conv,
> self.natural_arity)
..\rpython\rtyper\lltypesystem\ll2ctypes.py:1339:
_ _ _ _ _ _ _ _ _ _ _ _ _ _ _ _ _ _ _ _ _ _ _ _ _ _ _ _ _ _ _ _ _ _ _ _ _ _ _ _
funcptr = <* fn enter_suppress_iph>, calling_conv = 'c', natural_arity = -1
def get_ctypes_callable(funcptr, calling_conv, natural_arity):
if not ctypes:
raise ImportError("ctypes is needed to use ll2ctypes")
def get_on_lib(lib, elem):
""" Wrapper to always use lib[func] instead of lib.func
"""
try:
return lib[elem]
except AttributeError:
pass
old_eci = funcptr._obj.compilation_info
funcname = funcptr._obj._name
if hasattr(old_eci, '_with_ctypes'):
old_eci = old_eci._with_ctypes
try:
eci = _eci_cache[old_eci]
except KeyError:
eci = old_eci.compile_shared_lib(ignore_a_files=True,
defines=['RPYTHON_LL2CTYPES'],
> symbolic=True)
..\rpython\rtyper\lltypesystem\ll2ctypes.py:1236:
_ _ _ _ _ _ _ _ _ _ _ _ _ _ _ _ _ _ _ _ _ _ _ _ _ _ _ _ _ _ _ _ _ _ _ _ _ _ _ _
self = <ExternalCompilationInfo (pre_include_bits=(), includes=('errno.h', 'stdio.h',...estonly_libraries=(), use_cpp_linker=False, platform=<MsvcPlatform cc=cl.exe>)>
outputfilename = 'd:\\systemtemp\\pytest\\usession-main-3559\\shared_cache\\externmod_2'
ignore_a_files = False, debug_mode = True, defines = ['RPYTHON_LL2CTYPES']
symbolic = True
def compile_shared_lib(self, outputfilename=None, ignore_a_files=False,
debug_mode=True, defines=[], symbolic=False):
self = self.convert_sources_to_files()
if ignore_a_files:
if not [fn for fn in self.link_files if fn.endswith('.a')]:
ignore_a_files = False # there are none
if not self.separate_module_files and not ignore_a_files:
return self # xxx there was some condition about win32 here
else:
#basepath = py.path.local(self.separate_module_files[0]).dirpath()
basepath = udir.join('shared_cache')
if outputfilename is None:
# find more or less unique name there
pth = basepath.join('externmod').new(ext=host.so_ext)
num = 0
while pth.check():
pth = basepath.join(
'externmod_%d' % (num,)).new(ext=host.so_ext)
num += 1
basepath.ensure(dir=1)
outputfilename = str(pth.dirpath().join(pth.purebasename))
d = self._copy_attributes()
if ignore_a_files:
d['link_files'] = [fn for fn in d['link_files']
if not fn.endswith('.a')]
if debug_mode and sys.platform != 'win32':
d['compile_extra'] = d['compile_extra'] + ('-g', '-O0')
d['compile_extra'] = d['compile_extra'] + (
'-DRPY_EXTERN=RPY_EXPORTED',)
for define in defines:
d['compile_extra'] += ('-D%s' % define,)
# On ELF platforms (Linux), prevent symbol interposition: when the host
# interpreter (e.g. pypy2.7) also exports symbols like pypysig_counter,
# the shared lib's own references would otherwise resolve to the host's
# copy via the GOT. -Bsymbolic makes the shared lib bind its own global
# symbol references to its own definitions. Only needed when running
# under a host interpreter (tests), not during translation.
if symbolic and sys.platform not in ('win32', 'darwin'):
d['link_extra'] = d['link_extra'] + ('-Wl,-Bsymbolic',)
self = ExternalCompilationInfo(**d)
lib = str(host.compile([], self, outputfilename=outputfilename,
> standalone=False))
..\rpython\translator\tool\cbuild.py:345:
_ _ _ _ _ _ _ _ _ _ _ _ _ _ _ _ _ _ _ _ _ _ _ _ _ _ _ _ _ _ _ _ _ _ _ _ _ _ _ _
self = <MsvcPlatform cc=cl.exe>, cfiles = []
eci = <ExternalCompilationInfo (pre_include_bits=(), includes=('errno.h', 'stdio.h',...estonly_libraries=(), use_cpp_linker=False, platform=<MsvcPlatform cc=cl.exe>)>
outputfilename = 'd:\\systemtemp\\pytest\\usession-main-3559\\shared_cache\\externmod_2'
standalone = False
def compile(self, cfiles, eci, outputfilename=None, standalone=True):
> ofiles = self._compile_o_files(cfiles, eci, standalone)
..\rpython\translator\platform\__init__.py:57:
_ _ _ _ _ _ _ _ _ _ _ _ _ _ _ _ _ _ _ _ _ _ _ _ _ _ _ _ _ _ _ _ _ _ _ _ _ _ _ _
self = <MsvcPlatform cc=cl.exe>
cfiles = [local('d:\\systemtemp\\pytest\\usession-main-3559\\module_cache\\module_6.c')]
eci = <ExternalCompilationInfo (pre_include_bits=(), includes=('errno.h', 'stdio.h',...estonly_libraries=(), use_cpp_linker=False, platform=<MsvcPlatform cc=cl.exe>)>
standalone = False
def _compile_o_files(self, cfiles, eci, standalone=True):
cfiles = self._all_cfiles(cfiles, eci)
compile_args = self._compile_args_from_eci(eci, standalone)
ofiles = []
for cfile in cfiles:
# Windows hack: use masm for files ending in .asm
if str(cfile).lower().endswith('.asm'):
ofiles.append(self._compile_c_file(self.masm, cfile, []))
else:
> ofiles.append(self._compile_c_file(self.cc, cfile, compile_args))
..\rpython\translator\platform\__init__.py:79:
_ _ _ _ _ _ _ _ _ _ _ _ _ _ _ _ _ _ _ _ _ _ _ _ _ _ _ _ _ _ _ _ _ _ _ _ _ _ _ _
self = <MsvcPlatform cc=cl.exe>, cc = 'cl.exe'
cfile = local('d:\\systemtemp\\pytest\\usession-main-3559\\module_cache\\module_6.c')
compile_args = ['/MD', '/O2', '-DRPY_EXTERN=RPY_EXPORTED', '-DRPYTHON_LL2CTYPES', '/Fdd:\\systemtemp\\pytest\\usession-main-3559\\module_cache\\']
def _compile_c_file(self, cc, cfile, compile_args):
oname = self._make_o_file(cfile, ext='obj')
# notabene: (tismer)
# This function may be called for .c but also .asm files.
# The c compiler accepts any order of arguments, while
# the assembler still has the old behavior that all options
# must come first, and after the file name all options are ignored.
# So please be careful with the order of parameters! ;-)
pdb_dir = oname.dirname
if pdb_dir:
compile_args = compile_args + ['/Fd%s\\' % (pdb_dir,)]
args = ['/nologo', '/c'] + compile_args + ['/Fo%s' % (oname,), str(cfile)]
> self._execute_c_compiler(cc, args, oname)
..\rpython\translator\platform\windows.py:290:
_ _ _ _ _ _ _ _ _ _ _ _ _ _ _ _ _ _ _ _ _ _ _ _ _ _ _ _ _ _ _ _ _ _ _ _ _ _ _ _
self = <MsvcPlatform cc=cl.exe>, cc = 'cl.exe'
args = ['/nologo', '/c', '/MD', '/O2', '-DRPY_EXTERN=RPY_EXPORTED', '-DRPYTHON_LL2CTYPES', ...]
outname = local('d:\\systemtemp\\pytest\\usession-main-3559\\module_cache\\module_6.obj')
cwd = None
def _execute_c_compiler(self, cc, args, outname, cwd=None):
#log.execute(cc + ' ' + ' '.join(args))
# 'cc' can also contain some options for the C compiler;
# e.g. it can be "gcc -m32". We handle it by splitting on ' '.
cclist = cc.split()
cc = cclist[0]
args = cclist[1:] + args
returncode, stdout, stderr = _run_subprocess(cc, args, self.c_environ,
cwd)
> self._handle_error(returncode, stdout, stderr, outname)
..\rpython\translator\platform\__init__.py:143:
_ _ _ _ _ _ _ _ _ _ _ _ _ _ _ _ _ _ _ _ _ _ _ _ _ _ _ _ _ _ _ _ _ _ _ _ _ _ _ _
self = <MsvcPlatform cc=cl.exe>, returncode = 3221225477, stdout = ''
stderr = ''
outname = local('d:\\systemtemp\\pytest\\usession-main-3559\\module_cache\\module_6.obj')
def _handle_error(self, returncode, stdout, stderr, outname):
if returncode != 0:
# Microsoft compilers write compilation errors to stdout
stderr = stdout + stderr
errorfile = outname.new(ext='errors')
errorfile.write(stderr, mode='wb')
if self.log_errors:
stderrlines = stderr.splitlines()
for line in stderrlines:
log.Error(line)
# ^^^ don't use ERROR, because it might actually be fine.
# Also, ERROR confuses lib-python/conftest.py.
> raise CompilationError(stdout, stderr)
E CompilationError: CompilationError(out="""
E """)
..\rpython\translator\platform\windows.py:319: CompilationError
=========================== short test summary info ===========================
FAIL module\pypyjit\test\test_jit_hook.py::AppTestJitHook::()::test_on_compile_exception
=============== 1 failed, 27 passed, 1 skipped in 28.86 seconds ===============
++ 03:37:43 starting module/signal/test [115 started in total]
__ module/pyexpat/test [112 done in total, somefailed=False] __________________
============================= test session starts =============================
platform win32 -- Python 2.7.18[pypy-7.3.18-alpha], pytest-2.9.2, py-1.4.29, pluggy-0.3.1
hypothesis profile 'default' -> deadline=None, database=DirectoryBasedExampleDatabase('d:\\pypy_stuff\\buildbot64\\slave\\own-win-x86-64\\build\\pypy\\.hypothesis\\examples')
pytest-2.9.2 from d:\pypy_stuff\buildbot64\slave\own-win-x86-64\build\pytest.pyc
rootdir: d:\pypy_stuff\buildbot64\slave\own-win-x86-64\build, inifile: pytest.ini
plugins: hypothesis-4.39.3
collected 21 items
module\pyexpat\test\test_build.py .
module\pyexpat\test\test_parser.py ..................ss
==================== 19 passed, 2 skipped in 55.90 seconds ====================
++ 03:38:09 starting module/struct/test [116 started in total]
__ module/posix/test [113 done in total, somefailed=False] ____________________
============================= test session starts =============================
platform win32 -- Python 2.7.18[pypy-7.3.18-alpha], pytest-2.9.2, py-1.4.29, pluggy-0.3.1
hypothesis profile 'default' -> deadline=None, database=DirectoryBasedExampleDatabase('d:\\pypy_stuff\\buildbot64\\slave\\own-win-x86-64\\build\\pypy\\.hypothesis\\examples')
pytest-2.9.2 from d:\pypy_stuff\buildbot64\slave\own-win-x86-64\build\pytest.pyc
rootdir: d:\pypy_stuff\buildbot64\slave\own-win-x86-64\build, inifile: pytest.ini
plugins: hypothesis-4.39.3
collected 59 items
module\posix\test\test_posix2.py ................s...............s...........s....sss.s
module\posix\test\test_posix_libfile.py ..ss
module\posix\test\test_ztranslation.py .
==================== 50 passed, 9 skipped in 96.37 seconds ====================
++ 03:38:47 starting module/sys/test [117 started in total]
__ module/signal/test [114 done in total, somefailed=False] ___________________
============================= test session starts =============================
platform win32 -- Python 2.7.18[pypy-7.3.18-alpha], pytest-2.9.2, py-1.4.29, pluggy-0.3.1
hypothesis profile 'default' -> deadline=None, database=DirectoryBasedExampleDatabase('d:\\pypy_stuff\\buildbot64\\slave\\own-win-x86-64\\build\\pypy\\.hypothesis\\examples')
pytest-2.9.2 from d:\pypy_stuff\buildbot64\slave\own-win-x86-64\build\pytest.pyc
rootdir: d:\pypy_stuff\buildbot64\slave\own-win-x86-64\build, inifile: pytest.ini
plugins: hypothesis-4.39.3
collected 18 items
module\signal\test\test_signal.py s.s.....ss.s.sss..
==================== 10 passed, 8 skipped in 61.79 seconds ====================
++ 03:38:51 starting module/termios/test [118 started in total]
__ module/termios/test [115 done in total, somefailed=False] __________________
============================= test session starts =============================
platform win32 -- Python 2.7.18[pypy-7.3.18-alpha], pytest-2.9.2, py-1.4.29, pluggy-0.3.1
hypothesis profile 'default' -> deadline=None, database=DirectoryBasedExampleDatabase('d:\\pypy_stuff\\buildbot64\\slave\\own-win-x86-64\\build\\pypy\\.hypothesis\\examples')
pytest-2.9.2 from d:\pypy_stuff\buildbot64\slave\own-win-x86-64\build\pytest.pyc
rootdir: d:\pypy_stuff\buildbot64\slave\own-win-x86-64\build, inifile: pytest.ini
plugins: hypothesis-4.39.3
collected 0 items / 1 skipped
========================== 1 skipped in 0.38 seconds ==========================
++ 03:38:52 starting module/test_lib_pypy [119 started in total]
__ module/struct/test [116 done in total, somefailed=False] ___________________
============================= test session starts =============================
platform win32 -- Python 2.7.18[pypy-7.3.18-alpha], pytest-2.9.2, py-1.4.29, pluggy-0.3.1
hypothesis profile 'default' -> deadline=None, database=DirectoryBasedExampleDatabase('d:\\pypy_stuff\\buildbot64\\slave\\own-win-x86-64\\build\\pypy\\.hypothesis\\examples')
pytest-2.9.2 from d:\pypy_stuff\buildbot64\slave\own-win-x86-64\build\pytest.pyc
rootdir: d:\pypy_stuff\buildbot64\slave\own-win-x86-64\build, inifile: pytest.ini
plugins: hypothesis-4.39.3
collected 41 items
module\struct\test\test_struct.py ........................................
module\struct\test\test_ztranslation.py .
========================= 41 passed in 65.37 seconds ==========================
++ 03:39:16 starting module/thread/test [120 started in total]
__ module/select/test [117 done in total, somefailed=False] ___________________
============================= test session starts =============================
platform win32 -- Python 2.7.18[pypy-7.3.18-alpha], pytest-2.9.2, py-1.4.29, pluggy-0.3.1
hypothesis profile 'default' -> deadline=None, database=DirectoryBasedExampleDatabase('d:\\pypy_stuff\\buildbot64\\slave\\own-win-x86-64\\build\\pypy\\.hypothesis\\examples')
pytest-2.9.2 from d:\pypy_stuff\buildbot64\slave\own-win-x86-64\build\pytest.pyc
rootdir: d:\pypy_stuff\buildbot64\slave\own-win-x86-64\build, inifile: pytest.ini
plugins: hypothesis-4.39.3
collected 41 items
module\select\test\test_epoll.py ssssssss
module\select\test\test_kqueue.py sssss
module\select\test\test_select.py sssssssssssssss..........ss
module\select\test\test_ztranslation.py .
=================== 11 passed, 30 skipped in 134.07 seconds ===================
++ 03:39:35 starting module/time/test [121 started in total]
__ module/sys/test [118 done in total, somefailed=True] _______________________
============================= test session starts =============================
platform win32 -- Python 2.7.18[pypy-7.3.18-alpha], pytest-2.9.2, py-1.4.29, pluggy-0.3.1
hypothesis profile 'default' -> deadline=None, database=DirectoryBasedExampleDatabase('d:\\pypy_stuff\\buildbot64\\slave\\own-win-x86-64\\build\\pypy\\.hypothesis\\examples')
pytest-2.9.2 from d:\pypy_stuff\buildbot64\slave\own-win-x86-64\build\pytest.pyc
rootdir: d:\pypy_stuff\buildbot64\slave\own-win-x86-64\build, inifile: pytest.ini
plugins: hypothesis-4.39.3
[platform:msg] Updated environment with vsver 160, using x64 True
[platform:msg] Updated environment with vsver 160, using x64 True
collected 65 items
module\sys\test\apptest_initpath.py F
module\sys\test\test_encoding.py s
module\sys\test\test_initpath.py .s.....
module\sys\test\test_sysmodule.py ..............................ss....................
module\sys\test\test_version.py ....
================================== FAILURES ===================================
__________________________ test_pypy_find_executable __________________________
def test_pypy_find_executable():
# issue #4003
import sys
executable = sys.pypy_find_executable('*')
if sys.platform == 'win32':
> assert executable.endswith('.exe')
E (application-level) AssertionError: assert False
E + where False = <bound method str.endswith of ''>('.exe')
E + where <bound method str.endswith of ''> = ''.endswith
module\sys\test\apptest_initpath.py:9: AssertionError
=========================== short test summary info ===========================
FAIL module\sys\test\apptest_initpath.py::test_pypy_find_executable
=============== 1 failed, 60 passed, 4 skipped in 64.89 seconds ===============
++ 03:39:55 starting module/unicodedata/test [122 started in total]
__ module/test_lib_pypy [119 done in total, somefailed=False] _________________
============================= test session starts =============================
platform win32 -- Python 2.7.18[pypy-7.3.18-alpha], pytest-2.9.2, py-1.4.29, pluggy-0.3.1
hypothesis profile 'default' -> deadline=None, database=DirectoryBasedExampleDatabase('d:\\pypy_stuff\\buildbot64\\slave\\own-win-x86-64\\build\\pypy\\.hypothesis\\examples')
pytest-2.9.2 from d:\pypy_stuff\buildbot64\slave\own-win-x86-64\build\pytest.pyc
rootdir: d:\pypy_stuff\buildbot64\slave\own-win-x86-64\build, inifile: pytest.ini
plugins: hypothesis-4.39.3
collected 232 items / 5 skipped
module\test_lib_pypy\test_collections.py .....................
module\test_lib_pypy\test_marshal_extra.py .......................................................................................................................................................
module\test_lib_pypy\test_md5_extra.py ......
module\test_lib_pypy\test_msvcrt.py .
module\test_lib_pypy\test_pickle_extra.py s
module\test_lib_pypy\test_sha_extra.py ...
module\test_lib_pypy\test_site_extra.py .
module\test_lib_pypy\test_stackless.py ..............................
module\test_lib_pypy\test_stackless_pickling.py ..
module\test_lib_pypy\test_structseq.py .........
module\test_lib_pypy\test_tputil.py ..s....
=================== 230 passed, 7 skipped in 79.35 seconds ====================
++ 03:40:14 starting module/zipimport/test [123 started in total]
__ module/time/test [120 done in total, somefailed=False] _____________________
============================= test session starts =============================
platform win32 -- Python 2.7.18[pypy-7.3.18-alpha], pytest-2.9.2, py-1.4.29, pluggy-0.3.1
hypothesis profile 'default' -> deadline=None, database=DirectoryBasedExampleDatabase('d:\\pypy_stuff\\buildbot64\\slave\\own-win-x86-64\\build\\pypy\\.hypothesis\\examples')
pytest-2.9.2 from d:\pypy_stuff\buildbot64\slave\own-win-x86-64\build\pytest.pyc
rootdir: d:\pypy_stuff\buildbot64\slave\own-win-x86-64\build, inifile: pytest.ini
plugins: hypothesis-4.39.3
collected 18 items
module\time\test\test_time.py ...........s......
==================== 17 passed, 1 skipped in 51.90 seconds ====================
++ 03:40:35 starting module/zlib/test [124 started in total]
__ module/unicodedata/test [121 done in total, somefailed=False] ______________
============================= test session starts =============================
platform win32 -- Python 2.7.18[pypy-7.3.18-alpha], pytest-2.9.2, py-1.4.29, pluggy-0.3.1
hypothesis profile 'default' -> deadline=None, database=DirectoryBasedExampleDatabase('d:\\pypy_stuff\\buildbot64\\slave\\own-win-x86-64\\build\\pypy\\.hypothesis\\examples')
pytest-2.9.2 from d:\pypy_stuff\buildbot64\slave\own-win-x86-64\build\pytest.pyc
rootdir: d:\pypy_stuff\buildbot64\slave\own-win-x86-64\build, inifile: pytest.ini
plugins: hypothesis-4.39.3
collected 26 items
module\unicodedata\test\test_hyp.py ................
module\unicodedata\test\test_unicodedata.py ..........
========================= 26 passed in 47.74 seconds ==========================
++ 03:40:47 starting objspace/fake/test [125 started in total]
__ module/zlib/test [122 done in total, somefailed=False] _____________________
============================= test session starts =============================
platform win32 -- Python 2.7.18[pypy-7.3.18-alpha], pytest-2.9.2, py-1.4.29, pluggy-0.3.1
hypothesis profile 'default' -> deadline=None, database=DirectoryBasedExampleDatabase('d:\\pypy_stuff\\buildbot64\\slave\\own-win-x86-64\\build\\pypy\\.hypothesis\\examples')
pytest-2.9.2 from d:\pypy_stuff\buildbot64\slave\own-win-x86-64\build\pytest.pyc
rootdir: d:\pypy_stuff\buildbot64\slave\own-win-x86-64\build, inifile: pytest.ini
plugins: hypothesis-4.39.3
collected 31 items
module\zlib\test\test_zlib.py ...............................
========================= 31 passed in 31.79 seconds ==========================
++ 03:41:09 starting objspace/std/test [126 started in total]
__ module/zipimport/test [123 done in total, somefailed=False] ________________
============================= test session starts =============================
platform win32 -- Python 2.7.18[pypy-7.3.18-alpha], pytest-2.9.2, py-1.4.29, pluggy-0.3.1
hypothesis profile 'default' -> deadline=None, database=DirectoryBasedExampleDatabase('d:\\pypy_stuff\\buildbot64\\slave\\own-win-x86-64\\build\\pypy\\.hypothesis\\examples')
pytest-2.9.2 from d:\pypy_stuff\buildbot64\slave\own-win-x86-64\build\pytest.pyc
rootdir: d:\pypy_stuff\buildbot64\slave\own-win-x86-64\build, inifile: pytest.ini
plugins: hypothesis-4.39.3
collected 67 items
module\zipimport\test\test_undocumented.py ......
module\zipimport\test\test_zipimport.py ........................................
module\zipimport\test\test_zipimport_deflated.py .....................
========================= 67 passed in 141.96 seconds =========================
++ 03:42:41 starting objspace/test [127 started in total]
__ objspace/fake/test [124 done in total, somefailed=False] ___________________
============================= test session starts =============================
platform win32 -- Python 2.7.18[pypy-7.3.18-alpha], pytest-2.9.2, py-1.4.29, pluggy-0.3.1
hypothesis profile 'default' -> deadline=None, database=DirectoryBasedExampleDatabase('d:\\pypy_stuff\\buildbot64\\slave\\own-win-x86-64\\build\\pypy\\.hypothesis\\examples')
pytest-2.9.2 from d:\pypy_stuff\buildbot64\slave\own-win-x86-64\build\pytest.pyc
rootdir: d:\pypy_stuff\buildbot64\slave\own-win-x86-64\build, inifile: pytest.ini
plugins: hypothesis-4.39.3
collected 21 items
objspace\fake\test\test_checkmodule.py ........
objspace\fake\test\test_objspace.py .............
========================= 21 passed in 109.43 seconds =========================
++ 03:42:45 starting sandbox/test [128 started in total]
__ module/thread/test [125 done in total, somefailed=False] ___________________
============================= test session starts =============================
platform win32 -- Python 2.7.18[pypy-7.3.18-alpha], pytest-2.9.2, py-1.4.29, pluggy-0.3.1
hypothesis profile 'default' -> deadline=None, database=DirectoryBasedExampleDatabase('d:\\pypy_stuff\\buildbot64\\slave\\own-win-x86-64\\build\\pypy\\.hypothesis\\examples')
pytest-2.9.2 from d:\pypy_stuff\buildbot64\slave\own-win-x86-64\build\pytest.pyc
rootdir: d:\pypy_stuff\buildbot64\slave\own-win-x86-64\build, inifile: pytest.ini
plugins: hypothesis-4.39.3
collected 48 items
module\thread\test\test_fork.py sss
module\thread\test\test_gil.py ....
module\thread\test\test_import_lock.py .....
module\thread\test\test_local.py .......
module\thread\test\test_lock.py .............sss.
module\thread\test\test_thread.py ..........s.
=================== 41 passed, 7 skipped in 208.43 seconds ====================
++ 03:42:50 starting tool/bench/test [129 started in total]
__ sandbox/test [126 done in total, somefailed=False] _________________________
============================= test session starts =============================
platform win32 -- Python 2.7.18[pypy-7.3.18-alpha], pytest-2.9.2, py-1.4.29, pluggy-0.3.1
hypothesis profile 'default' -> deadline=None, database=DirectoryBasedExampleDatabase('d:\\pypy_stuff\\buildbot64\\slave\\own-win-x86-64\\build\\pypy\\.hypothesis\\examples')
pytest-2.9.2 from d:\pypy_stuff\buildbot64\slave\own-win-x86-64\build\pytest.pyc
rootdir: d:\pypy_stuff\buildbot64\slave\own-win-x86-64\build, inifile: pytest.ini
plugins: hypothesis-4.39.3
collected 0 items / 1 skipped
========================== 1 skipped in 3.32 seconds ==========================
++ 03:42:51 starting tool/memusage/test [130 started in total]
__ tool/bench/test [127 done in total, somefailed=False] ______________________
============================= test session starts =============================
platform win32 -- Python 2.7.18[pypy-7.3.18-alpha], pytest-2.9.2, py-1.4.29, pluggy-0.3.1
hypothesis profile 'default' -> deadline=None, database=DirectoryBasedExampleDatabase('d:\\pypy_stuff\\buildbot64\\slave\\own-win-x86-64\\build\\pypy\\.hypothesis\\examples')
pytest-2.9.2 from d:\pypy_stuff\buildbot64\slave\own-win-x86-64\build\pytest.pyc
rootdir: d:\pypy_stuff\buildbot64\slave\own-win-x86-64\build, inifile: pytest.ini
plugins: hypothesis-4.39.3
collected 3 items / 1 skipped
[platform:msg] Updated environment with vsver 160, using x64 True
[platform:msg] Updated environment with vsver 160, using x64 True
tool\bench\test\test_pypyresult.py ...
===================== 3 passed, 1 skipped in 6.03 seconds =====================
++ 03:42:57 starting tool/pytest/test [131 started in total]
__ tool/memusage/test [128 done in total, somefailed=False] ___________________
============================= test session starts =============================
platform win32 -- Python 2.7.18[pypy-7.3.18-alpha], pytest-2.9.2, py-1.4.29, pluggy-0.3.1
hypothesis profile 'default' -> deadline=None, database=DirectoryBasedExampleDatabase('d:\\pypy_stuff\\buildbot64\\slave\\own-win-x86-64\\build\\pypy\\.hypothesis\\examples')
pytest-2.9.2 from d:\pypy_stuff\buildbot64\slave\own-win-x86-64\build\pytest.pyc
rootdir: d:\pypy_stuff\buildbot64\slave\own-win-x86-64\build, inifile: pytest.ini
plugins: hypothesis-4.39.3
collected 5 items
[platform:msg] Updated environment with vsver 160, using x64 True
[platform:msg] Updated environment with vsver 160, using x64 True
tool\memusage\test\test_log2gnumeric.py .....
========================== 5 passed in 5.56 seconds ===========================
++ 03:42:58 starting tool/release/test [132 started in total]
__ objspace/test [129 done in total, somefailed=False] ________________________
============================= test session starts =============================
platform win32 -- Python 2.7.18[pypy-7.3.18-alpha], pytest-2.9.2, py-1.4.29, pluggy-0.3.1
hypothesis profile 'default' -> deadline=None, database=DirectoryBasedExampleDatabase('d:\\pypy_stuff\\buildbot64\\slave\\own-win-x86-64\\build\\pypy\\.hypothesis\\examples')
pytest-2.9.2 from d:\pypy_stuff\buildbot64\slave\own-win-x86-64\build\pytest.pyc
rootdir: d:\pypy_stuff\buildbot64\slave\own-win-x86-64\build, inifile: pytest.ini
plugins: hypothesis-4.39.3
[platform:msg] Updated environment with vsver 160, using x64 True
[platform:msg] Updated environment with vsver 160, using x64 True
collected 59 items
objspace\test\apptest_binop_overriding.py .
objspace\test\apptest_descriptor.py ........
objspace\test\apptest_descroperation.py ............s..........................
objspace\test\test_descroperation.py ...........
==================== 58 passed, 1 skipped in 21.18 seconds ====================
++ 03:43:06 starting tool/test [133 started in total]
__ tool/test [130 done in total, somefailed=False] ____________________________
============================= test session starts =============================
platform win32 -- Python 2.7.18[pypy-7.3.18-alpha], pytest-2.9.2, py-1.4.29, pluggy-0.3.1
hypothesis profile 'default' -> deadline=None, database=DirectoryBasedExampleDatabase('d:\\pypy_stuff\\buildbot64\\slave\\own-win-x86-64\\build\\pypy\\.hypothesis\\examples')
pytest-2.9.2 from d:\pypy_stuff\buildbot64\slave\own-win-x86-64\build\pytest.pyc
rootdir: d:\pypy_stuff\buildbot64\slave\own-win-x86-64\build, inifile: pytest.ini
plugins: hypothesis-4.39.3
collected 29 items
tool\test\test_gdb_pypy.py ...........
tool\test\test_getdocstrings.py ...
tool\test\test_isolate.py .......
tool\test\test_lib_pypy.py ...
tool\test\test_license.py .
tool\test\test_package.py .
tool\test\test_tab.py ..
tool\test\test_template.py .
========================= 29 passed in 28.12 seconds ==========================
__ tool/release/test [131 done in total, somefailed=False] ____________________
============================= test session starts =============================
platform win32 -- Python 2.7.18[pypy-7.3.18-alpha], pytest-2.9.2, py-1.4.29, pluggy-0.3.1
hypothesis profile 'default' -> deadline=None, database=DirectoryBasedExampleDatabase('d:\\pypy_stuff\\buildbot64\\slave\\own-win-x86-64\\build\\pypy\\.hypothesis\\examples')
pytest-2.9.2 from d:\pypy_stuff\buildbot64\slave\own-win-x86-64\build\pytest.pyc
rootdir: d:\pypy_stuff\buildbot64\slave\own-win-x86-64\build, inifile: pytest.ini
plugins: hypothesis-4.39.3
collected 8 items
tool\release\test\test_package.py ...ss
tool\release\test\test_smartstrip.py sss
==================== 3 passed, 5 skipped in 51.59 seconds =====================
__ tool/pytest/test [132 done in total, somefailed=False] _____________________
============================= test session starts =============================
platform win32 -- Python 2.7.18[pypy-7.3.18-alpha], pytest-2.9.2, py-1.4.29, pluggy-0.3.1
hypothesis profile 'default' -> deadline=None, database=DirectoryBasedExampleDatabase('d:\\pypy_stuff\\buildbot64\\slave\\own-win-x86-64\\build\\pypy\\.hypothesis\\examples')
pytest-2.9.2 from d:\pypy_stuff\buildbot64\slave\own-win-x86-64\build\pytest.pyc
rootdir: d:\pypy_stuff\buildbot64\slave\own-win-x86-64\build, inifile: pytest.ini
plugins: hypothesis-4.39.3
collected 24 items
tool\pytest\test\test_appsupport.py .........
tool\pytest\test\test_astrewrite.py .....
tool\pytest\test\test_conftest1.py ..
tool\pytest\test\test_pytestsupport.py ........
========================= 24 passed in 110.78 seconds =========================
__ objspace/std/test [133 done in total, somefailed=False] ____________________
============================= test session starts =============================
platform win32 -- Python 2.7.18[pypy-7.3.18-alpha], pytest-2.9.2, py-1.4.29, pluggy-0.3.1
hypothesis profile 'default' -> deadline=None, database=DirectoryBasedExampleDatabase('d:\\pypy_stuff\\buildbot64\\slave\\own-win-x86-64\\build\\pypy\\.hypothesis\\examples')
pytest-2.9.2 from d:\pypy_stuff\buildbot64\slave\own-win-x86-64\build\pytest.pyc
rootdir: d:\pypy_stuff\buildbot64\slave\own-win-x86-64\build, inifile: pytest.ini
plugins: hypothesis-4.39.3
[platform:msg] Updated environment with vsver 160, using x64 True
[platform:msg] Updated environment with vsver 160, using x64 True
collected 2132 items
objspace\std\test\apptest_boolobject.py ........
objspace\std\test\apptest_bufferobject.py ...............
objspace\std\test\apptest_callmethod.py ........
objspace\std\test\apptest_complexobject.py ...............................
objspace\std\test\apptest_instmethobject.py .....
objspace\std\test\apptest_iterobject.py ..............
objspace\std\test\apptest_operation.py ...
objspace\std\test\apptest_stringformat.py ...............s...........................s........
objspace\std\test\apptest_userobject.py ......................
objspace\std\test\test_boolobject.py .......
objspace\std\test\test_bytearrayobject.py .......................................................
objspace\std\test\test_bytesobject.py ......................................................................s.......
objspace\std\test\test_callmethod.py ...
objspace\std\test\test_celldict.py .......................................
objspace\std\test\test_complexobject.py ....
objspace\std\test\test_dictmultiobject.py ...........s.....................................................................................................................................................................
objspace\std\test\test_dictproxy.py ..........
objspace\std\test\test_floatobject.py ......................................
objspace\std\test\test_identitydict.py ......
objspace\std\test\test_identityset.py .......
objspace\std\test\test_index.py ..............................................
objspace\std\test\test_intobject.py .........................s..................................s........................................s...............
objspace\std\test\test_iterobject.py ....
objspace\std\test\test_jsondict.py ...........
objspace\std\test\test_kwargsdict.py ....................................
objspace\std\test\test_lengthhint.py ....................
objspace\std\test\test_listobject.py .......................................................................................................................
objspace\std\test\test_liststrategies.py ...................................................................s..................................................................
objspace\std\test\test_longobject.py .........................................
objspace\std\test\test_mapdict.py ...............................................................................................................................................
objspace\std\test\test_memoryobject.py .......
objspace\std\test\test_methodcache.py .......................................................................
objspace\std\test\test_newformat.py .......................................................................................s........
objspace\std\test\test_noneobject.py ...
objspace\std\test\test_obj.py .......................
objspace\std\test\test_prebuiltint.py ...........................s...............
objspace\std\test\test_proxy.py ssssssssssss
objspace\std\test\test_proxy_function.py ........
objspace\std\test\test_proxy_internals.py ........
objspace\std\test\test_proxy_iter.py .
objspace\std\test\test_proxy_object.py ..........
objspace\std\test\test_proxy_usercreated.py .
objspace\std\test\test_random_attr.py .....
objspace\std\test\test_setobject.py ....................................................................................
objspace\std\test\test_setstrategies.py ....s...ss..
objspace\std\test\test_sliceobject.py ............
objspace\std\test\test_smalllongobject.py .........................s..................................s.....................................................................................s..................................s..............
objspace\std\test\test_specialisedtupleobject.py ..................ss.......................
objspace\std\test\test_stdobjspace.py s......
objspace\std\test\test_tupleobject.py ...................................
objspace\std\test\test_typeobject.py ..............................................................................
objspace\std\test\test_unicodeobject.py .................................s........................................................s.................
objspace\std\test\test_userobject.py .
objspace\std\test\test_versionedtype.py ...............
================== 2098 passed, 34 skipped in 226.99 seconds ==================
program finished with exit code 1
elapsedTime=1599.986000