virt_test\Scripts\python.exe testrunner/runner.py --logfile=testrun.log --config=pypy/testrunner_cfg.py --config=~/machine_cfg.py --root=pypy --timeout=4000
in dir d:\pypy_stuff\buildbot64\slave\own-win-x86-64\build (timeout 4000 secs)
watching logfiles {'pytestLog': 'testrun.log'}
argv: ['virt_test\\Scripts\\python.exe', 'testrunner/runner.py', '--logfile=testrun.log', '--config=pypy/testrunner_cfg.py', '--config=~/machine_cfg.py', '--root=pypy', '--timeout=4000']
environment:
ALLUSERSPROFILE=C:\ProgramData
APPDATA=C:\Users\matti\AppData\Roaming
ASL.LOG=Destination=file
CHOCOLATEYINSTALL=C:\ProgramData\chocolatey
CHOCOLATEYLASTPATHUPDATE=133185086718935289
CHOCOLATEYTOOLSLOCATION=C:\tools
CLINK_DIR=C:\Program Files (x86)\clink\0.4.9
COMMONPROGRAMFILES=C:\Program Files (x86)\Common Files
COMMONPROGRAMFILES(X86)=C:\Program Files (x86)\Common Files
COMMONPROGRAMW6432=C:\Program Files\Common Files
COMPUTERNAME=DESKTOP-RYZEN
COMSPEC=C:\WINDOWS\system32\cmd.exe
CONDA_BAT=d:\miniconda\condabin\conda.bat
CONDA_EXE=d:\miniconda\Scripts\conda.exe
CONDA_SHLVL=0
CUDA_PATH=C:\Program Files\NVIDIA GPU Computing Toolkit\CUDA\v11.7
CUDA_PATH_V11_7=C:\Program Files\NVIDIA GPU Computing Toolkit\CUDA\v11.7
DRIVERDATA=C:\Windows\System32\Drivers\DriverData
LOCALAPPDATA=C:\Users\matti\AppData\Local
NUMBER_OF_PROCESSORS=2
NVTOOLSEXT_PATH=C:\Program Files\NVIDIA Corporation\NvToolsExt\
OS=Windows_NT
PATH=d:\CPython27\lib\site-packages\pywin32_system32;d:\pypy_stuff\pypy\externals\bin;D:\CPython27;D:\pypy_stuff\pypy2.7-v7.3.18\Scripts;D:\pypy_stuff\pypy2.7-v7.3.18;C:\Windows\system32;C:\Windows;C:\Windows\System32\Wbem;C:\Windows\System32\WindowsPowerShell\v1.0\;C:\Program Files\TortoiseHg\;C:\Program Files\Git\cmd;C:\ProgramData\chocolatey\bin;C:\WINDOWS\System32\OpenSSH
PATHEXT=.COM;.EXE;.BAT;.CMD;.VBS;.VBE;.JS;.JSE;.WSF;.WSH;.MSC
PROCESSOR_ARCHITECTURE=x86
PROCESSOR_ARCHITEW6432=AMD64
PROCESSOR_IDENTIFIER=AMD64 Family 23 Model 113 Stepping 0, AuthenticAMD
PROCESSOR_LEVEL=23
PROCESSOR_REVISION=7100
PROGRAMDATA=C:\ProgramData
PROGRAMFILES=C:\Program Files (x86)
PROGRAMFILES(X86)=C:\Program Files (x86)
PROGRAMW6432=C:\Program Files
PROMPT=$P$G
PSMODULEPATH=%ProgramFiles%\WindowsPowerShell\Modules;C:\WINDOWS\system32\WindowsPowerShell\v1.0\Modules
PUBLIC=C:\Users\Public
PWD=d:\pypy_stuff\buildbot64\slave\own-win-x86-64\build
PYPYCHERRYPICK=
PYPY_ENABLE_WINCONSOLEIO=1
PYTEST_XDIST_AUTO_NUM_WORKERS=4
PYTHONPATH=.;
RTOOLS40_HOME=C:\rtools40
RTOOLS43_HOME=C:\rtools43
RTOOLS44_HOME=C:\rtools44
SYSTEMDRIVE=C:
SYSTEMROOT=C:\WINDOWS
TEMP=D:\SystemTemp
TMP=D:\SystemTemp
TMPDIR=d:\systemtemp\pytest
USERDOMAIN=DESKTOP-RYZEN
USERNAME=matti
USERPROFILE=C:\Users\matti
VS140COMNTOOLS=C:\Program Files (x86)\Microsoft Visual Studio 14.0\Common7\Tools\
WINDIR=C:\WINDOWS
using PTY: False
using config pypy/testrunner_cfg.py
using config C:\Users\matti/machine_cfg.py
running 4 parallel test workers
setting MAKEFLAGS to ' ' (space)
-- config/test
-- interpreter/astcompiler/test
-- interpreter/pyparser/test
-- interpreter/test
-- module/__builtin__/test
-- module/__pypy__/test
-- module/_ast/test
-- module/_cffi_backend/test
-- module/_codecs/test
-- module/_continuation/test
-- module/_cppyy/test
-- module/_csv/test
-- module/_demo/test
-- module/_file/test
-- module/_io/test
-- module/_jitlog/test
-- module/_locale/test
-- module/_lsprof/test
-- module/_md5/test
-- module/_minimal_curses/test
-- module/_multibytecodec/test
-- module/_multiprocessing/test
-- module/_pypyjson/test
-- module/_random/test
-- module/_rawffi/alt/test
-- module/_rawffi/test
-- module/_sha/test
-- module/_socket/test
-- module/_sre/test
-- module/_vmprof/test
-- module/_warnings/test
-- module/_weakref/test
-- module/_winreg/test
-- module/array/test
-- module/binascii/test
-- module/bz2/test
-- module/cStringIO/test
-- module/cmath/test
-- module/cpyext/test/test_abstract.py
-- module/cpyext/test/test_api.py
-- module/cpyext/test/test_arraymodule.py
-- module/cpyext/test/test_boolobject.py
-- module/cpyext/test/test_borrow.py
-- module/cpyext/test/test_bufferobject.py
-- module/cpyext/test/test_bytearrayobject.py
-- module/cpyext/test/test_bytesobject.py
-- module/cpyext/test/test_capsule.py
-- module/cpyext/test/test_cell.py
-- module/cpyext/test/test_classobject.py
-- module/cpyext/test/test_codecs.py
-- module/cpyext/test/test_complexobject.py
-- module/cpyext/test/test_cpyext.py
-- module/cpyext/test/test_datetime.py
-- module/cpyext/test/test_dictobject.py
-- module/cpyext/test/test_eval.py
-- module/cpyext/test/test_fileobject.py
-- module/cpyext/test/test_floatobject.py
-- module/cpyext/test/test_frameobject.py
-- module/cpyext/test/test_funcobject.py
-- module/cpyext/test/test_genobject.py
-- module/cpyext/test/test_getargs.py
-- module/cpyext/test/test_import.py
-- module/cpyext/test/test_intobject.py
-- module/cpyext/test/test_iterator.py
-- module/cpyext/test/test_listobject.py
-- module/cpyext/test/test_longobject.py
-- module/cpyext/test/test_mapping.py
-- module/cpyext/test/test_marshal.py
-- module/cpyext/test/test_memoryobject.py
-- module/cpyext/test/test_methodobject.py
-- module/cpyext/test/test_misc.py
-- module/cpyext/test/test_module.py
-- module/cpyext/test/test_ndarrayobject.py
-- module/cpyext/test/test_number.py
-- module/cpyext/test/test_object.py
-- module/cpyext/test/test_pycobject.py
-- module/cpyext/test/test_pyerrors.py
-- module/cpyext/test/test_pyfile.py
-- module/cpyext/test/test_pysignals.py
-- module/cpyext/test/test_pystate.py
-- module/cpyext/test/test_pystrtod.py
-- module/cpyext/test/test_sequence.py
-- module/cpyext/test/test_setobject.py
-- module/cpyext/test/test_sliceobject.py
-- module/cpyext/test/test_structseq.py
-- module/cpyext/test/test_sysmodule.py
-- module/cpyext/test/test_thread.py
-- module/cpyext/test/test_traceback.py
-- module/cpyext/test/test_translate.py
-- module/cpyext/test/test_tupleobject.py
-- module/cpyext/test/test_typeobject.py
-- module/cpyext/test/test_unicodeobject.py
-- module/cpyext/test/test_userslots.py
-- module/cpyext/test/test_version.py
-- module/cpyext/test/test_weakref.py
-- module/crypt/test
-- module/errno/test
-- module/exceptions/test
-- module/faulthandler/test
-- module/fcntl/test
-- module/gc/test
-- module/imp/test
-- module/itertools/test
-- module/marshal/test
-- module/math/test
-- module/micronumpy/test
-- module/mmap/test
-- module/operator/test
-- module/parser/test
-- module/posix/test
-- module/pwd/test
-- module/pyexpat/test
-- module/pypyjit/test
-- module/select/test
-- module/signal/test
-- module/struct/test
-- module/sys/test
-- module/termios/test
-- module/test_lib_pypy
-- module/thread/test
-- module/time/test
-- module/unicodedata/test
-- module/zipimport/test
-- module/zlib/test
-- objspace/fake/test
-- objspace/std/test
-- objspace/test
-- sandbox/test
-- tool/bench/test
-- tool/memusage/test
-- tool/pytest/test
-- tool/release/test
-- tool/test
-- total: 133 to run
++ 03:28:36 starting config/test [1 started in total]
++ 03:28:36 starting interpreter/astcompiler/test [2 started in total]
++ 03:28:36 starting interpreter/pyparser/test [3 started in total]
++ 03:28:36 starting interpreter/test [4 started in total]
__ config/test [1 done in total, somefailed=False] ____________________________
============================= test session starts =============================
platform win32 -- Python 2.7.18[pypy-7.3.18-alpha], pytest-2.9.2, py-1.4.29, pluggy-0.3.1
hypothesis profile 'default' -> deadline=None, database=DirectoryBasedExampleDatabase('d:\\pypy_stuff\\buildbot64\\slave\\own-win-x86-64\\build\\pypy\\.hypothesis\\examples')
pytest-2.9.2 from d:\pypy_stuff\buildbot64\slave\own-win-x86-64\build\pytest.py
rootdir: d:\pypy_stuff\buildbot64\slave\own-win-x86-64\build, inifile: pytest.ini
plugins: hypothesis-4.39.3
collected 158 items / 1 skipped
config\test\test_pypyoption.py ..............................................................................................................................................................
=================== 158 passed, 1 skipped in 48.24 seconds ====================
++ 03:29:28 starting module/__builtin__/test [5 started in total]
__ interpreter/pyparser/test [2 done in total, somefailed=False] ______________
============================= test session starts =============================
platform win32 -- Python 2.7.18[pypy-7.3.18-alpha], pytest-2.9.2, py-1.4.29, pluggy-0.3.1
hypothesis profile 'default' -> deadline=None, database=DirectoryBasedExampleDatabase('d:\\pypy_stuff\\buildbot64\\slave\\own-win-x86-64\\build\\pypy\\.hypothesis\\examples')
pytest-2.9.2 from d:\pypy_stuff\buildbot64\slave\own-win-x86-64\build\pytest.pyc
rootdir: d:\pypy_stuff\buildbot64\slave\own-win-x86-64\build, inifile: pytest.ini
plugins: hypothesis-4.39.3
collected 119 items
interpreter\pyparser\test\test_automata.py ...
interpreter\pyparser\test\test_future.py .....................................
interpreter\pyparser\test\test_gendfa.py .
interpreter\pyparser\test\test_metaparser.py ...............
interpreter\pyparser\test\test_parser.py .............
interpreter\pyparser\test\test_parsestring.py .........
interpreter\pyparser\test\test_pyparse.py ....................................
interpreter\pyparser\test\test_pytokenizer.py .....
========================= 119 passed in 80.36 seconds =========================
++ 03:30:05 starting module/__pypy__/test [6 started in total]
__ interpreter/astcompiler/test [3 done in total, somefailed=False] ___________
============================= test session starts =============================
platform win32 -- Python 2.7.18[pypy-7.3.18-alpha], pytest-2.9.2, py-1.4.29, pluggy-0.3.1
hypothesis profile 'default' -> deadline=None, database=DirectoryBasedExampleDatabase('d:\\pypy_stuff\\buildbot64\\slave\\own-win-x86-64\\build\\pypy\\.hypothesis\\examples')
pytest-2.9.2 from d:\pypy_stuff\buildbot64\slave\own-win-x86-64\build\pytest.pyc
rootdir: d:\pypy_stuff\buildbot64\slave\own-win-x86-64\build, inifile: pytest.ini
plugins: hypothesis-4.39.3
[platform:msg] Updated environment with vsver 160, using x64 True
[platform:msg] Updated environment with vsver 160, using x64 True
collected 447 items
interpreter\astcompiler\test\apptest_misc.py .
interpreter\astcompiler\test\test_ast.py .......
interpreter\astcompiler\test\test_astbuilder.py .....................................................
interpreter\astcompiler\test\test_compiler.py ..........................................................................................................................................................................................................................................................................................................................................................................
interpreter\astcompiler\test\test_misc.py .
interpreter\astcompiler\test\test_symtable.py .......................
======================== 447 passed in 107.74 seconds =========================
++ 03:30:26 starting module/_ast/test [7 started in total]
__ module/__builtin__/test [4 done in total, somefailed=False] ________________
============================= test session starts =============================
platform win32 -- Python 2.7.18[pypy-7.3.18-alpha], pytest-2.9.2, py-1.4.29, pluggy-0.3.1
hypothesis profile 'default' -> deadline=None, database=DirectoryBasedExampleDatabase('d:\\pypy_stuff\\buildbot64\\slave\\own-win-x86-64\\build\\pypy\\.hypothesis\\examples')
pytest-2.9.2 from d:\pypy_stuff\buildbot64\slave\own-win-x86-64\build\pytest.pyc
rootdir: d:\pypy_stuff\buildbot64\slave\own-win-x86-64\build, inifile: pytest.ini
plugins: hypothesis-4.39.3
[platform:msg] Updated environment with vsver 160, using x64 True
[platform:msg] Updated environment with vsver 160, using x64 True
collected 305 items
module\__builtin__\test\apptest_compile.py ........
module\__builtin__\test\test_abstractinst.py ............
module\__builtin__\test\test_apply.py ...
module\__builtin__\test\test_builtin.py ..............................................s.....................
module\__builtin__\test\test_classobj.py ...........................................................
module\__builtin__\test\test_descriptor.py ..........................
module\__builtin__\test\test_filter.py ...........
module\__builtin__\test\test_functional.py .................................................
module\__builtin__\test\test_minmax.py ..........................
module\__builtin__\test\test_range.py ........................
module\__builtin__\test\test_rawinput.py ...
module\__builtin__\test\test_reduce.py ....
module\__builtin__\test\test_vars.py ...
module\__builtin__\test\test_zip.py .........
=================== 304 passed, 1 skipped in 52.00 seconds ====================
++ 03:30:28 starting module/_cffi_backend/test [8 started in total]
__ module/_ast/test [5 done in total, somefailed=False] _______________________
============================= test session starts =============================
platform win32 -- Python 2.7.18[pypy-7.3.18-alpha], pytest-2.9.2, py-1.4.29, pluggy-0.3.1
hypothesis profile 'default' -> deadline=None, database=DirectoryBasedExampleDatabase('d:\\pypy_stuff\\buildbot64\\slave\\own-win-x86-64\\build\\pypy\\.hypothesis\\examples')
pytest-2.9.2 from d:\pypy_stuff\buildbot64\slave\own-win-x86-64\build\pytest.pyc
rootdir: d:\pypy_stuff\buildbot64\slave\own-win-x86-64\build, inifile: pytest.ini
plugins: hypothesis-4.39.3
collected 36 items
module\_ast\test\test_ast.py ....................................
========================= 36 passed in 26.89 seconds ==========================
++ 03:30:55 starting module/_codecs/test [9 started in total]
__ module/__pypy__/test [6 done in total, somefailed=False] ___________________
============================= test session starts =============================
platform win32 -- Python 2.7.18[pypy-7.3.18-alpha], pytest-2.9.2, py-1.4.29, pluggy-0.3.1
hypothesis profile 'default' -> deadline=None, database=DirectoryBasedExampleDatabase('d:\\pypy_stuff\\buildbot64\\slave\\own-win-x86-64\\build\\pypy\\.hypothesis\\examples')
pytest-2.9.2 from d:\pypy_stuff\buildbot64\slave\own-win-x86-64\build\pytest.pyc
rootdir: d:\pypy_stuff\buildbot64\slave\own-win-x86-64\build, inifile: pytest.ini
plugins: hypothesis-4.39.3
collected 68 items
module\__pypy__\test\test_builders.py .....
module\__pypy__\test\test_bytebuffer.py ..
module\__pypy__\test\test_debug.py .......
module\__pypy__\test\test_identitydict.py ......
module\__pypy__\test\test_intop.py ...........
module\__pypy__\test\test_locals2fast.py .....
module\__pypy__\test\test_magic.py .......
module\__pypy__\test\test_newmemoryview.py ...
module\__pypy__\test\test_os.py .
module\__pypy__\test\test_signal.py ...ss
module\__pypy__\test\test_special.py ............s
module\__pypy__\test\test_time.py sss
==================== 62 passed, 6 skipped in 45.66 seconds ====================
++ 03:30:57 starting module/_continuation/test [10 started in total]
__ module/_codecs/test [7 done in total, somefailed=False] ____________________
============================= test session starts =============================
platform win32 -- Python 2.7.18[pypy-7.3.18-alpha], pytest-2.9.2, py-1.4.29, pluggy-0.3.1
hypothesis profile 'default' -> deadline=None, database=DirectoryBasedExampleDatabase('d:\\pypy_stuff\\buildbot64\\slave\\own-win-x86-64\\build\\pypy\\.hypothesis\\examples')
pytest-2.9.2 from d:\pypy_stuff\buildbot64\slave\own-win-x86-64\build\pytest.pyc
rootdir: d:\pypy_stuff\buildbot64\slave\own-win-x86-64\build, inifile: pytest.ini
plugins: hypothesis-4.39.3
collected 65 items
module\_codecs\test\test_codecs.py ................................................................
module\_codecs\test\test_ztranslation.py .
========================= 65 passed in 43.01 seconds ==========================
++ 03:31:40 starting module/_cppyy/test [11 started in total]
__ module/_cppyy/test [8 done in total, somefailed=False] _____________________
============================= test session starts =============================
platform win32 -- Python 2.7.18[pypy-7.3.18-alpha], pytest-2.9.2, py-1.4.29, pluggy-0.3.1
hypothesis profile 'default' -> deadline=None, database=DirectoryBasedExampleDatabase('d:\\pypy_stuff\\buildbot64\\slave\\own-win-x86-64\\build\\pypy\\.hypothesis\\examples')
pytest-2.9.2 from d:\pypy_stuff\buildbot64\slave\own-win-x86-64\build\pytest.pyc
rootdir: d:\pypy_stuff\buildbot64\slave\own-win-x86-64\build, inifile: pytest.ini
plugins: hypothesis-4.39.3
collected 0 items
======================== no tests ran in 0.01 seconds =========================
++ 03:31:56 starting module/_csv/test [12 started in total]
__ module/_continuation/test [9 done in total, somefailed=False] ______________
============================= test session starts =============================
platform win32 -- Python 2.7.18[pypy-7.3.18-alpha], pytest-2.9.2, py-1.4.29, pluggy-0.3.1
hypothesis profile 'default' -> deadline=None, database=DirectoryBasedExampleDatabase('d:\\pypy_stuff\\buildbot64\\slave\\own-win-x86-64\\build\\pypy\\.hypothesis\\examples')
pytest-2.9.2 from d:\pypy_stuff\buildbot64\slave\own-win-x86-64\build\pytest.pyc
rootdir: d:\pypy_stuff\buildbot64\slave\own-win-x86-64\build, inifile: pytest.ini
plugins: hypothesis-4.39.3
collected 81 items / 1 skipped
module\_continuation\test\test_generator.py ssss
module\_continuation\test\test_greenlet.py s.ssssss.sssssssssssssss.sss
module\_continuation\test\test_translated.py sssssssssssssssssssssssssssss
module\_continuation\test\test_zpickle.py ssssssssssssssssssss
==================== 3 passed, 79 skipped in 53.08 seconds ====================
++ 03:31:57 starting module/_demo/test [13 started in total]
__ module/_csv/test [10 done in total, somefailed=False] ______________________
============================= test session starts =============================
platform win32 -- Python 2.7.18[pypy-7.3.18-alpha], pytest-2.9.2, py-1.4.29, pluggy-0.3.1
hypothesis profile 'default' -> deadline=None, database=DirectoryBasedExampleDatabase('d:\\pypy_stuff\\buildbot64\\slave\\own-win-x86-64\\build\\pypy\\.hypothesis\\examples')
pytest-2.9.2 from d:\pypy_stuff\buildbot64\slave\own-win-x86-64\build\pytest.pyc
rootdir: d:\pypy_stuff\buildbot64\slave\own-win-x86-64\build, inifile: pytest.ini
plugins: hypothesis-4.39.3
collected 23 items
module\_csv\test\test_dialect.py .........
module\_csv\test\test_reader.py .........
module\_csv\test\test_writer.py ....
module\_csv\test\test_ztranslation.py .
========================= 23 passed in 24.34 seconds ==========================
++ 03:32:25 starting module/_file/test [14 started in total]
__ module/_demo/test [11 done in total, somefailed=False] _____________________
============================= test session starts =============================
platform win32 -- Python 2.7.18[pypy-7.3.18-alpha], pytest-2.9.2, py-1.4.29, pluggy-0.3.1
hypothesis profile 'default' -> deadline=None, database=DirectoryBasedExampleDatabase('d:\\pypy_stuff\\buildbot64\\slave\\own-win-x86-64\\build\\pypy\\.hypothesis\\examples')
pytest-2.9.2 from d:\pypy_stuff\buildbot64\slave\own-win-x86-64\build\pytest.pyc
rootdir: d:\pypy_stuff\buildbot64\slave\own-win-x86-64\build, inifile: pytest.ini
plugins: hypothesis-4.39.3
collected 3 items
module\_demo\test\test_import.py ..
module\_demo\test\test_sieve.py .
========================== 3 passed in 24.48 seconds ==========================
++ 03:32:26 starting module/_io/test [15 started in total]
__ module/_file/test [12 done in total, somefailed=False] _____________________
============================= test session starts =============================
platform win32 -- Python 2.7.18[pypy-7.3.18-alpha], pytest-2.9.2, py-1.4.29, pluggy-0.3.1
hypothesis profile 'default' -> deadline=None, database=DirectoryBasedExampleDatabase('d:\\pypy_stuff\\buildbot64\\slave\\own-win-x86-64\\build\\pypy\\.hypothesis\\examples')
pytest-2.9.2 from d:\pypy_stuff\buildbot64\slave\own-win-x86-64\build\pytest.pyc
rootdir: d:\pypy_stuff\buildbot64\slave\own-win-x86-64\build, inifile: pytest.ini
plugins: hypothesis-4.39.3
collected 269 items
module\_file\test\test_file.py .....................ss..sss......
module\_file\test\test_file_extra.py ..................................................................................................................................................................ss..............ss..............ss..............ss...........s......s.s
module\_file\test\test_large_file.py .s
=================== 252 passed, 17 skipped in 69.26 seconds ===================
++ 03:33:39 starting module/_jitlog/test [16 started in total]
__ module/_io/test [13 done in total, somefailed=False] _______________________
============================= test session starts =============================
platform win32 -- Python 2.7.18[pypy-7.3.18-alpha], pytest-2.9.2, py-1.4.29, pluggy-0.3.1
hypothesis profile 'default' -> deadline=None, database=DirectoryBasedExampleDatabase('d:\\pypy_stuff\\buildbot64\\slave\\own-win-x86-64\\build\\pypy\\.hypothesis\\examples')
pytest-2.9.2 from d:\pypy_stuff\buildbot64\slave\own-win-x86-64\build\pytest.pyc
rootdir: d:\pypy_stuff\buildbot64\slave\own-win-x86-64\build, inifile: pytest.ini
plugins: hypothesis-4.39.3
[platform:msg] Updated environment with vsver 160, using x64 True
[platform:msg] Updated environment with vsver 160, using x64 True
collected 200 items
module\_io\test\apptest_bytesio.py ............
module\_io\test\apptest_io.py ................................
module\_io\test\apptest_stringio.py .........................
module\_io\test\apptest_textio.py ...........................
module\_io\test\test_bufferedio.py ..............................................................................
module\_io\test\test_fileio.py ...............s......
module\_io\test\test_interp_textio.py ....
=================== 199 passed, 1 skipped in 81.52 seconds ====================
++ 03:33:55 starting module/_locale/test [17 started in total]
__ module/_jitlog/test [14 done in total, somefailed=False] ___________________
============================= test session starts =============================
platform win32 -- Python 2.7.18[pypy-7.3.18-alpha], pytest-2.9.2, py-1.4.29, pluggy-0.3.1
hypothesis profile 'default' -> deadline=None, database=DirectoryBasedExampleDatabase('d:\\pypy_stuff\\buildbot64\\slave\\own-win-x86-64\\build\\pypy\\.hypothesis\\examples')
pytest-2.9.2 from d:\pypy_stuff\buildbot64\slave\own-win-x86-64\build\pytest.pyc
rootdir: d:\pypy_stuff\buildbot64\slave\own-win-x86-64\build, inifile: pytest.ini
plugins: hypothesis-4.39.3
collected 1 items
module\_jitlog\test\test__jitlog.py s
========================= 1 skipped in 17.37 seconds ==========================
++ 03:34:00 starting module/_lsprof/test [18 started in total]
__ module/_locale/test [15 done in total, somefailed=False] ___________________
============================= test session starts =============================
platform win32 -- Python 2.7.18[pypy-7.3.18-alpha], pytest-2.9.2, py-1.4.29, pluggy-0.3.1
hypothesis profile 'default' -> deadline=None, database=DirectoryBasedExampleDatabase('d:\\pypy_stuff\\buildbot64\\slave\\own-win-x86-64\\build\\pypy\\.hypothesis\\examples')
pytest-2.9.2 from d:\pypy_stuff\buildbot64\slave\own-win-x86-64\build\pytest.pyc
rootdir: d:\pypy_stuff\buildbot64\slave\own-win-x86-64\build, inifile: pytest.ini
plugins: hypothesis-4.39.3
collected 14 items
module\_locale\test\test_locale.py .........ssss.
==================== 10 passed, 4 skipped in 25.06 seconds ====================
++ 03:34:24 starting module/_md5/test [19 started in total]
__ module/_lsprof/test [16 done in total, somefailed=False] ___________________
============================= test session starts =============================
platform win32 -- Python 2.7.18[pypy-7.3.18-alpha], pytest-2.9.2, py-1.4.29, pluggy-0.3.1
hypothesis profile 'default' -> deadline=None, database=DirectoryBasedExampleDatabase('d:\\pypy_stuff\\buildbot64\\slave\\own-win-x86-64\\build\\pypy\\.hypothesis\\examples')
pytest-2.9.2 from d:\pypy_stuff\buildbot64\slave\own-win-x86-64\build\pytest.pyc
rootdir: d:\pypy_stuff\buildbot64\slave\own-win-x86-64\build, inifile: pytest.ini
plugins: hypothesis-4.39.3
collected 6 items
module\_lsprof\test\test_cprofile.py ......
========================== 6 passed in 28.21 seconds ==========================
++ 03:34:34 starting module/_minimal_curses/test [20 started in total]
__ module/_md5/test [17 done in total, somefailed=False] ______________________
============================= test session starts =============================
platform win32 -- Python 2.7.18[pypy-7.3.18-alpha], pytest-2.9.2, py-1.4.29, pluggy-0.3.1
hypothesis profile 'default' -> deadline=None, database=DirectoryBasedExampleDatabase('d:\\pypy_stuff\\buildbot64\\slave\\own-win-x86-64\\build\\pypy\\.hypothesis\\examples')
pytest-2.9.2 from d:\pypy_stuff\buildbot64\slave\own-win-x86-64\build\pytest.pyc
rootdir: d:\pypy_stuff\buildbot64\slave\own-win-x86-64\build, inifile: pytest.ini
plugins: hypothesis-4.39.3
collected 6 items
module\_md5\test\test_md5.py .s....
==================== 5 passed, 1 skipped in 21.81 seconds =====================
++ 03:34:49 starting module/_multibytecodec/test [21 started in total]
__ module/_minimal_curses/test [18 done in total, somefailed=False] ___________
============================= test session starts =============================
platform win32 -- Python 2.7.18[pypy-7.3.18-alpha], pytest-2.9.2, py-1.4.29, pluggy-0.3.1
hypothesis profile 'default' -> deadline=None, database=DirectoryBasedExampleDatabase('d:\\pypy_stuff\\buildbot64\\slave\\own-win-x86-64\\build\\pypy\\.hypothesis\\examples')
pytest-2.9.2 from d:\pypy_stuff\buildbot64\slave\own-win-x86-64\build\pytest.pyc
rootdir: d:\pypy_stuff\buildbot64\slave\own-win-x86-64\build, inifile: pytest.ini
plugins: hypothesis-4.39.3
collected 6 items
[platform:msg] Updated environment with vsver 160, using x64 True
[platform:msg] Updated environment with vsver 160, using x64 True
module\_minimal_curses\test\test_curses.py ssssss
========================= 6 skipped in 18.57 seconds ==========================
++ 03:34:55 starting module/_multiprocessing/test [22 started in total]
__ module/_multibytecodec/test [19 done in total, somefailed=False] ___________
============================= test session starts =============================
platform win32 -- Python 2.7.18[pypy-7.3.18-alpha], pytest-2.9.2, py-1.4.29, pluggy-0.3.1
hypothesis profile 'default' -> deadline=None, database=DirectoryBasedExampleDatabase('d:\\pypy_stuff\\buildbot64\\slave\\own-win-x86-64\\build\\pypy\\.hypothesis\\examples')
pytest-2.9.2 from d:\pypy_stuff\buildbot64\slave\own-win-x86-64\build\pytest.pyc
rootdir: d:\pypy_stuff\buildbot64\slave\own-win-x86-64\build, inifile: pytest.ini
plugins: hypothesis-4.39.3
collected 51 items
module\_multibytecodec\test\test_app_codecs.py ................
module\_multibytecodec\test\test_app_incremental.py ............
module\_multibytecodec\test\test_app_stream.py .....
module\_multibytecodec\test\test_c_codecs.py ................s
module\_multibytecodec\test\test_translation.py .
==================== 50 passed, 1 skipped in 52.55 seconds ====================
++ 03:35:48 starting module/_pypyjson/test [23 started in total]
__ module/_pypyjson/test [20 done in total, somefailed=False] _________________
============================= test session starts =============================
platform win32 -- Python 2.7.18[pypy-7.3.18-alpha], pytest-2.9.2, py-1.4.29, pluggy-0.3.1
hypothesis profile 'default' -> deadline=None, database=DirectoryBasedExampleDatabase('d:\\pypy_stuff\\buildbot64\\slave\\own-win-x86-64\\build\\pypy\\.hypothesis\\examples')
pytest-2.9.2 from d:\pypy_stuff\buildbot64\slave\own-win-x86-64\build\pytest.pyc
rootdir: d:\pypy_stuff\buildbot64\slave\own-win-x86-64\build, inifile: pytest.ini
plugins: hypothesis-4.39.3
collected 45 items
module\_pypyjson\test\test__pypyjson.py ..........................................
module\_pypyjson\test\test_simd.py ...
========================= 45 passed in 22.23 seconds ==========================
++ 03:36:13 starting module/_random/test [24 started in total]
__ module/_multiprocessing/test [21 done in total, somefailed=False] __________
============================= test session starts =============================
platform win32 -- Python 2.7.18[pypy-7.3.18-alpha], pytest-2.9.2, py-1.4.29, pluggy-0.3.1
hypothesis profile 'default' -> deadline=None, database=DirectoryBasedExampleDatabase('d:\\pypy_stuff\\buildbot64\\slave\\own-win-x86-64\\build\\pypy\\.hypothesis\\examples')
pytest-2.9.2 from d:\pypy_stuff\buildbot64\slave\own-win-x86-64\build\pytest.pyc
rootdir: d:\pypy_stuff\buildbot64\slave\own-win-x86-64\build, inifile: pytest.ini
plugins: hypothesis-4.39.3
collected 24 items
module\_multiprocessing\test\test_connection.py ...........
module\_multiprocessing\test\test_interp_semaphore.py .
module\_multiprocessing\test\test_memory.py ..
module\_multiprocessing\test\test_semaphore.py .......
module\_multiprocessing\test\test_win32.py ..
module\_multiprocessing\test\test_ztranslation.py .
========================= 24 passed in 142.28 seconds =========================
++ 03:37:21 starting module/_rawffi/alt/test [25 started in total]
__ module/_random/test [22 done in total, somefailed=False] ___________________
============================= test session starts =============================
platform win32 -- Python 2.7.18[pypy-7.3.18-alpha], pytest-2.9.2, py-1.4.29, pluggy-0.3.1
hypothesis profile 'default' -> deadline=None, database=DirectoryBasedExampleDatabase('d:\\pypy_stuff\\buildbot64\\slave\\own-win-x86-64\\build\\pypy\\.hypothesis\\examples')
pytest-2.9.2 from d:\pypy_stuff\buildbot64\slave\own-win-x86-64\build\pytest.pyc
rootdir: d:\pypy_stuff\buildbot64\slave\own-win-x86-64\build, inifile: pytest.ini
plugins: hypothesis-4.39.3
collected 14 items
module\_random\test\test_random.py .............
module\_random\test\test_ztranslation.py .
========================= 14 passed in 73.93 seconds ==========================
++ 03:37:35 starting module/_rawffi/test [26 started in total]
__ interpreter/test [23 done in total, somefailed=True] _______________________
============================= test session starts =============================
platform win32 -- Python 2.7.18[pypy-7.3.18-alpha], pytest-2.9.2, py-1.4.29, pluggy-0.3.1
hypothesis profile 'default' -> deadline=None, database=DirectoryBasedExampleDatabase('d:\\pypy_stuff\\buildbot64\\slave\\own-win-x86-64\\build\\pypy\\.hypothesis\\examples')
pytest-2.9.2 from d:\pypy_stuff\buildbot64\slave\own-win-x86-64\build\pytest.pyc
rootdir: d:\pypy_stuff\buildbot64\slave\own-win-x86-64\build, inifile: pytest.ini
plugins: hypothesis-4.39.3
[platform:msg] Updated environment with vsver 160, using x64 True
[platform:msg] Updated environment with vsver 160, using x64 True
collected 773 items
interpreter\test\apptest_class.py ...............
interpreter\test\apptest_exec.py ............................
interpreter\test\apptest_function.py ........................s..............................
interpreter\test\apptest_generator.py ..................................
interpreter\test\apptest_nestedscope.py .............
interpreter\test\apptest_pyframe.py .............................
interpreter\test\apptest_raise.py .....................
interpreter\test\test_app_main.py ....sssssssssssssssssssssssssssssssssss.............s......s......
interpreter\test\test_appinterp.py .............
interpreter\test\test_argument.py ...................................
interpreter\test\test_buffer.py ..
interpreter\test\test_cellfamily.py .......
interpreter\test\test_code.py ........
interpreter\test\test_compiler.py .........................................................................................................................
interpreter\test\test_descrtypecheck.py ..
interpreter\test\test_error.py ..........
interpreter\test\test_exceptcomp.py ...........
interpreter\test\test_exec.py .
interpreter\test\test_executioncontext.py ................
interpreter\test\test_extmodules.py .
interpreter\test\test_function.py ..........
interpreter\test\test_gateway.py ........................................ss............
interpreter\test\test_generator.py .
interpreter\test\test_interpreter.py ..........................
interpreter\test\test_main.py ....
interpreter\test\test_mixedmodule.py ......
interpreter\test\test_module.py ........
interpreter\test\test_objspace.py ..............................
interpreter\test\test_pycode.py .
interpreter\test\test_pyframe.py ..
interpreter\test\test_reverse_debugging.py ..
interpreter\test\test_special.py ..
interpreter\test\test_syntax.py ....................................................................
interpreter\test\test_targetpypy.py ..
interpreter\test\test_typedef.py ..................
interpreter\test\test_unicodehelper.py ..........
interpreter\test\test_zpy.py ....sF
interpreter\test\test_zzpickle_and_slow.py ...............s...................
================================== FAILURES ===================================
________________________________ test_pytrace _________________________________
def test_pytrace():
output = run(sys.executable, pypypath, '-S',
stdin="__pytrace__ = 1\nx = 5\nx")
assert ('\t<module>: LOAD_CONST 0 (5)\n'
'\t<module>: STORE_NAME 0 (x)\n'
'\t<module>: LOAD_CONST 1 (None)\n'
'\t<module>: RETURN_VALUE 0 \n'
'>>>> ') in output
assert ('\t<module>: LOAD_NAME 0 (x)\n'
'\t<module>: PRINT_EXPR 0 \n'
# '5\n' --- this line sent to stderr
'\t<module>: LOAD_CONST 0 (None)\n'
'\t<module>: RETURN_VALUE 0 \n'
> '>>>> ') in output
E assert '\t<module>: LOAD_NAME 0 (x)\n\t<module>: PRINT_EXPR 0 \n\t<module>: LOAD_CONST 0 (None)\n\t<module>: RETURN_VALUE 0 \n>>>> ' in '>>>> Tracing enabled\n>>>> \t<module>: LOAD_CONST 0 (5)\n\t<module>: STORE_NAME 0 (x)\n\t<m... PRINT_EXPR 0 5\n\n\t<module>: LOAD_CONST 0 (None)\n\t<module>: RETURN_VALUE 0 \n>>>> '
interpreter\test\test_zpy.py:121: AssertionError
---------------------------- Captured stderr call -----------------------------
[platform:msg] Updated environment with vsver 160, using x64 True
[platform:msg] Updated environment with vsver 160, using x64 True
PyPy 8.0.0-alpha0 in StdObjSpace on top of Python 2.7.18 (startuptime: 11.55 secs)
=========================== short test summary info ===========================
FAIL interpreter\test\test_zpy.py::test_pytrace
============= 1 failed, 730 passed, 42 skipped in 551.44 seconds ==============
++ 03:37:56 starting module/_sha/test [27 started in total]
__ module/_rawffi/alt/test [24 done in total, somefailed=False] _______________
============================= test session starts =============================
platform win32 -- Python 2.7.18[pypy-7.3.18-alpha], pytest-2.9.2, py-1.4.29, pluggy-0.3.1
hypothesis profile 'default' -> deadline=None, database=DirectoryBasedExampleDatabase('d:\\pypy_stuff\\buildbot64\\slave\\own-win-x86-64\\build\\pypy\\.hypothesis\\examples')
pytest-2.9.2 from d:\pypy_stuff\buildbot64\slave\own-win-x86-64\build\pytest.pyc
rootdir: d:\pypy_stuff\buildbot64\slave\own-win-x86-64\build, inifile: pytest.ini
plugins: hypothesis-4.39.3
collected 73 items
module\_rawffi\alt\test\test_ffitype.py .....
module\_rawffi\alt\test\test_funcptr.py ..s..............................ss.ss....
module\_rawffi\alt\test\test_struct.py ...............
module\_rawffi\alt\test\test_type_converter.py ...........
==================== 68 passed, 5 skipped in 35.09 seconds ====================
++ 03:38:01 starting module/_socket/test [28 started in total]
__ module/_sha/test [25 done in total, somefailed=False] ______________________
============================= test session starts =============================
platform win32 -- Python 2.7.18[pypy-7.3.18-alpha], pytest-2.9.2, py-1.4.29, pluggy-0.3.1
hypothesis profile 'default' -> deadline=None, database=DirectoryBasedExampleDatabase('d:\\pypy_stuff\\buildbot64\\slave\\own-win-x86-64\\build\\pypy\\.hypothesis\\examples')
pytest-2.9.2 from d:\pypy_stuff\buildbot64\slave\own-win-x86-64\build\pytest.pyc
rootdir: d:\pypy_stuff\buildbot64\slave\own-win-x86-64\build, inifile: pytest.ini
plugins: hypothesis-4.39.3
collected 6 items
module\_sha\test\test_sha.py .s....
==================== 5 passed, 1 skipped in 22.25 seconds =====================
++ 03:38:21 starting module/_sre/test [29 started in total]
__ module/_rawffi/test [26 done in total, somefailed=False] ___________________
============================= test session starts =============================
platform win32 -- Python 2.7.18[pypy-7.3.18-alpha], pytest-2.9.2, py-1.4.29, pluggy-0.3.1
hypothesis profile 'default' -> deadline=None, database=DirectoryBasedExampleDatabase('d:\\pypy_stuff\\buildbot64\\slave\\own-win-x86-64\\build\\pypy\\.hypothesis\\examples')
pytest-2.9.2 from d:\pypy_stuff\buildbot64\slave\own-win-x86-64\build\pytest.pyc
rootdir: d:\pypy_stuff\buildbot64\slave\own-win-x86-64\build, inifile: pytest.ini
plugins: hypothesis-4.39.3
[platform:msg] Updated environment with vsver 160, using x64 True
[platform:msg] Updated environment with vsver 160, using x64 True
collected 83 items
module\_rawffi\test\apptest_rawffi.py .
module\_rawffi\test\test__rawffi.py .................s.................................s................
module\_rawffi\test\test_exit.py s
module\_rawffi\test\test_nested.py ......
module\_rawffi\test\test_struct.py ...
module\_rawffi\test\test_tracker.py ...
module\_rawffi\test\test_ztranslation.py .
==================== 80 passed, 3 skipped in 75.12 seconds ====================
n: 2
Arg 0: 3
Arg 1: 15
++ 03:38:56 starting module/_vmprof/test [30 started in total]
__ module/_cffi_backend/test [27 done in total, somefailed=False] _____________
[platform:msg] Updated environment with vsver 160, using x64 True
============================= test session starts =============================
platform win32 -- Python 2.7.18[pypy-7.3.18-alpha], pytest-2.9.2, py-1.4.29, pluggy-0.3.1
hypothesis profile 'default' -> deadline=None, database=DirectoryBasedExampleDatabase('d:\\pypy_stuff\\buildbot64\\slave\\own-win-x86-64\\build\\pypy\\.hypothesis\\examples')
pytest-2.9.2 from d:\pypy_stuff\buildbot64\slave\own-win-x86-64\build\pytest.pyc
rootdir: d:\pypy_stuff\buildbot64\slave\own-win-x86-64\build, inifile: pytest.ini
plugins: hypothesis-4.39.3
collected 466 items
module\_cffi_backend\test\test_c.py s..............................................................................ssss.s....................................................s.....s...................sss...........................s...s........................s......
module\_cffi_backend\test\test_fastpath.py ..................
module\_cffi_backend\test\test_ffi_obj.py .............................................
module\_cffi_backend\test\test_file.py s..
module\_cffi_backend\test\test_parse_c_type.py ..............s...
module\_cffi_backend\test\test_re_python.py .................s..
module\_cffi_backend\test\test_recompiler.py .............................s...........................................................s..s............ssss..s.s.ss.......
module\_cffi_backend\test\test_unicode_literals.py .......
module\_cffi_backend\test\test_wchar_helper.py .
module\_cffi_backend\test\test_ztranslation.py s
================== 437 passed, 29 skipped in 505.96 seconds ===================
++ 03:38:58 starting module/_warnings/test [31 started in total]
__ module/_vmprof/test [28 done in total, somefailed=False] ___________________
============================= test session starts =============================
platform win32 -- Python 2.7.18[pypy-7.3.18-alpha], pytest-2.9.2, py-1.4.29, pluggy-0.3.1
hypothesis profile 'default' -> deadline=None, database=DirectoryBasedExampleDatabase('d:\\pypy_stuff\\buildbot64\\slave\\own-win-x86-64\\build\\pypy\\.hypothesis\\examples')
pytest-2.9.2 from d:\pypy_stuff\buildbot64\slave\own-win-x86-64\build\pytest.pyc
rootdir: d:\pypy_stuff\buildbot64\slave\own-win-x86-64\build, inifile: pytest.ini
plugins: hypothesis-4.39.3
collected 0 items
======================== no tests ran in 0.00 seconds =========================
++ 03:38:59 starting module/_weakref/test [32 started in total]
__ module/_sre/test [29 done in total, somefailed=False] ______________________
============================= test session starts =============================
platform win32 -- Python 2.7.18[pypy-7.3.18-alpha], pytest-2.9.2, py-1.4.29, pluggy-0.3.1
hypothesis profile 'default' -> deadline=None, database=DirectoryBasedExampleDatabase('d:\\pypy_stuff\\buildbot64\\slave\\own-win-x86-64\\build\\pypy\\.hypothesis\\examples')
pytest-2.9.2 from d:\pypy_stuff\buildbot64\slave\own-win-x86-64\build\pytest.pyc
rootdir: d:\pypy_stuff\buildbot64\slave\own-win-x86-64\build, inifile: pytest.ini
plugins: hypothesis-4.39.3
collected 139 items
module\_sre\test\test_app_sre.py ...................................................................................................................
module\_sre\test\test_sre_buf.py ........................
========================= 139 passed in 54.39 seconds =========================
++ 03:39:21 starting module/_winreg/test [33 started in total]
__ module/_weakref/test [30 done in total, somefailed=False] __________________
============================= test session starts =============================
platform win32 -- Python 2.7.18[pypy-7.3.18-alpha], pytest-2.9.2, py-1.4.29, pluggy-0.3.1
hypothesis profile 'default' -> deadline=None, database=DirectoryBasedExampleDatabase('d:\\pypy_stuff\\buildbot64\\slave\\own-win-x86-64\\build\\pypy\\.hypothesis\\examples')
pytest-2.9.2 from d:\pypy_stuff\buildbot64\slave\own-win-x86-64\build\pytest.pyc
rootdir: d:\pypy_stuff\buildbot64\slave\own-win-x86-64\build, inifile: pytest.ini
plugins: hypothesis-4.39.3
collected 42 items
module\_weakref\test\test_weakref.py ....................s.....................
==================== 41 passed, 1 skipped in 35.90 seconds ====================
++ 03:39:39 starting module/array/test [34 started in total]
__ module/_warnings/test [31 done in total, somefailed=False] _________________
============================= test session starts =============================
platform win32 -- Python 2.7.18[pypy-7.3.18-alpha], pytest-2.9.2, py-1.4.29, pluggy-0.3.1
hypothesis profile 'default' -> deadline=None, database=DirectoryBasedExampleDatabase('d:\\pypy_stuff\\buildbot64\\slave\\own-win-x86-64\\build\\pypy\\.hypothesis\\examples')
pytest-2.9.2 from d:\pypy_stuff\buildbot64\slave\own-win-x86-64\build\pytest.pyc
rootdir: d:\pypy_stuff\buildbot64\slave\own-win-x86-64\build, inifile: pytest.ini
plugins: hypothesis-4.39.3
[platform:msg] Updated environment with vsver 160, using x64 True
[platform:msg] Updated environment with vsver 160, using x64 True
collected 12 items
module\_warnings\test\apptest_warnings.py ...........
module\_warnings\test\test_warnings.py .
========================= 12 passed in 38.95 seconds ==========================
++ 03:39:44 starting module/binascii/test [35 started in total]
__ module/_winreg/test [32 done in total, somefailed=False] ___________________
============================= test session starts =============================
platform win32 -- Python 2.7.18[pypy-7.3.18-alpha], pytest-2.9.2, py-1.4.29, pluggy-0.3.1
hypothesis profile 'default' -> deadline=None, database=DirectoryBasedExampleDatabase('d:\\pypy_stuff\\buildbot64\\slave\\own-win-x86-64\\build\\pypy\\.hypothesis\\examples')
pytest-2.9.2 from d:\pypy_stuff\buildbot64\slave\own-win-x86-64\build\pytest.pyc
rootdir: d:\pypy_stuff\buildbot64\slave\own-win-x86-64\build, inifile: pytest.ini
plugins: hypothesis-4.39.3
collected 18 items
module\_winreg\test\test_winreg.py ............s..ss.
==================== 15 passed, 3 skipped in 25.40 seconds ====================
++ 03:39:51 starting module/bz2/test [36 started in total]
__ module/_socket/test [33 done in total, somefailed=False] ___________________
============================= test session starts =============================
platform win32 -- Python 2.7.18[pypy-7.3.18-alpha], pytest-2.9.2, py-1.4.29, pluggy-0.3.1
hypothesis profile 'default' -> deadline=None, database=DirectoryBasedExampleDatabase('d:\\pypy_stuff\\buildbot64\\slave\\own-win-x86-64\\build\\pypy\\.hypothesis\\examples')
pytest-2.9.2 from d:\pypy_stuff\buildbot64\slave\own-win-x86-64\build\pytest.pyc
rootdir: d:\pypy_stuff\buildbot64\slave\own-win-x86-64\build, inifile: pytest.ini
plugins: hypothesis-4.39.3
collected 60 items
module\_socket\test\test_sock_app.py .......s..........s.............s...........s.s.ss.........
module\_socket\test\test_ztranslation.py .
=================== 53 passed, 7 skipped in 114.14 seconds ====================
++ 03:39:58 starting module/cStringIO/test [37 started in total]
__ module/bz2/test [34 done in total, somefailed=False] _______________________
============================= test session starts =============================
platform win32 -- Python 2.7.18[pypy-7.3.18-alpha], pytest-2.9.2, py-1.4.29, pluggy-0.3.1
hypothesis profile 'default' -> deadline=None, database=DirectoryBasedExampleDatabase('d:\\pypy_stuff\\buildbot64\\slave\\own-win-x86-64\\build\\pypy\\.hypothesis\\examples')
pytest-2.9.2 from d:\pypy_stuff\buildbot64\slave\own-win-x86-64\build\pytest.pyc
rootdir: d:\pypy_stuff\buildbot64\slave\own-win-x86-64\build, inifile: pytest.ini
plugins: hypothesis-4.39.3
collected 1 items / 2 skipped
module\bz2\test\test_large.py s
========================= 3 skipped in 14.50 seconds ==========================
++ 03:40:08 starting module/cmath/test [38 started in total]
__ module/binascii/test [35 done in total, somefailed=False] __________________
============================= test session starts =============================
platform win32 -- Python 2.7.18[pypy-7.3.18-alpha], pytest-2.9.2, py-1.4.29, pluggy-0.3.1
hypothesis profile 'default' -> deadline=None, database=DirectoryBasedExampleDatabase('d:\\pypy_stuff\\buildbot64\\slave\\own-win-x86-64\\build\\pypy\\.hypothesis\\examples')
pytest-2.9.2 from d:\pypy_stuff\buildbot64\slave\own-win-x86-64\build\pytest.pyc
rootdir: d:\pypy_stuff\buildbot64\slave\own-win-x86-64\build, inifile: pytest.ini
plugins: hypothesis-4.39.3
collected 14 items
module\binascii\test\test_binascii.py ..............
========================= 14 passed in 23.23 seconds ==========================
++ 03:40:09 starting module/cpyext/test/test_abstract.py [39 started in total]
__ module/cStringIO/test [36 done in total, somefailed=False] _________________
============================= test session starts =============================
platform win32 -- Python 2.7.18[pypy-7.3.18-alpha], pytest-2.9.2, py-1.4.29, pluggy-0.3.1
hypothesis profile 'default' -> deadline=None, database=DirectoryBasedExampleDatabase('d:\\pypy_stuff\\buildbot64\\slave\\own-win-x86-64\\build\\pypy\\.hypothesis\\examples')
pytest-2.9.2 from d:\pypy_stuff\buildbot64\slave\own-win-x86-64\build\pytest.pyc
rootdir: d:\pypy_stuff\buildbot64\slave\own-win-x86-64\build, inifile: pytest.ini
plugins: hypothesis-4.39.3
collected 16 items
module\cStringIO\test\test_interp_stringio.py ...............
module\cStringIO\test\test_ztranslation.py .
========================= 16 passed in 23.29 seconds ==========================
++ 03:40:23 starting module/cpyext/test/test_api.py [40 started in total]
__ module/cmath/test [37 done in total, somefailed=False] _____________________
============================= test session starts =============================
platform win32 -- Python 2.7.18[pypy-7.3.18-alpha], pytest-2.9.2, py-1.4.29, pluggy-0.3.1
hypothesis profile 'default' -> deadline=None, database=DirectoryBasedExampleDatabase('d:\\pypy_stuff\\buildbot64\\slave\\own-win-x86-64\\build\\pypy\\.hypothesis\\examples')
pytest-2.9.2 from d:\pypy_stuff\buildbot64\slave\own-win-x86-64\build\pytest.pyc
rootdir: d:\pypy_stuff\buildbot64\slave\own-win-x86-64\build, inifile: pytest.ini
plugins: hypothesis-4.39.3
collected 15 items
module\cmath\test\test_cmath.py ...............
========================= 15 passed in 27.03 seconds ==========================
++ 03:40:37 starting module/cpyext/test/test_arraymodule.py [41 started in total]
__ module/array/test [38 done in total, somefailed=False] _____________________
============================= test session starts =============================
platform win32 -- Python 2.7.18[pypy-7.3.18-alpha], pytest-2.9.2, py-1.4.29, pluggy-0.3.1
hypothesis profile 'default' -> deadline=None, database=DirectoryBasedExampleDatabase('d:\\pypy_stuff\\buildbot64\\slave\\own-win-x86-64\\build\\pypy\\.hypothesis\\examples')
pytest-2.9.2 from d:\pypy_stuff\buildbot64\slave\own-win-x86-64\build\pytest.pyc
rootdir: d:\pypy_stuff\buildbot64\slave\own-win-x86-64\build, inifile: pytest.ini
plugins: hypothesis-4.39.3
collected 49 items
module\array\test\test_array.py ....................................s...........
module\array\test\test_ztranslation.py .
==================== 48 passed, 1 skipped in 72.70 seconds ====================
++ 03:40:53 starting module/cpyext/test/test_boolobject.py [42 started in total]
__ module/cpyext/test/test_api.py [39 done in total, somefailed=False] ________
============================= test session starts =============================
platform win32 -- Python 2.7.18[pypy-7.3.18-alpha], pytest-2.9.2, py-1.4.29, pluggy-0.3.1
hypothesis profile 'default' -> deadline=None, database=DirectoryBasedExampleDatabase('d:\\pypy_stuff\\buildbot64\\slave\\own-win-x86-64\\build\\pypy\\.hypothesis\\examples')
pytest-2.9.2 from d:\pypy_stuff\buildbot64\slave\own-win-x86-64\build\pytest.pyc
rootdir: d:\pypy_stuff\buildbot64\slave\own-win-x86-64\build, inifile: pytest.ini
plugins: hypothesis-4.39.3
collected 0 items / 1 skipped
========================== 1 skipped in 0.02 seconds ==========================
++ 03:40:57 starting module/cpyext/test/test_borrow.py [43 started in total]
__ module/cpyext/test/test_arraymodule.py [40 done in total, somefailed=False]
============================= test session starts =============================
platform win32 -- Python 2.7.18[pypy-7.3.18-alpha], pytest-2.9.2, py-1.4.29, pluggy-0.3.1
hypothesis profile 'default' -> deadline=None, database=DirectoryBasedExampleDatabase('d:\\pypy_stuff\\buildbot64\\slave\\own-win-x86-64\\build\\pypy\\.hypothesis\\examples')
pytest-2.9.2 from d:\pypy_stuff\buildbot64\slave\own-win-x86-64\build\pytest.pyc
rootdir: d:\pypy_stuff\buildbot64\slave\own-win-x86-64\build, inifile: pytest.ini
plugins: hypothesis-4.39.3
collected 0 items / 1 skipped
========================== 1 skipped in 0.02 seconds ==========================
++ 03:40:59 starting module/cpyext/test/test_bufferobject.py [44 started in total]
__ module/cpyext/test/test_abstract.py [41 done in total, somefailed=False] ___
============================= test session starts =============================
platform win32 -- Python 2.7.18[pypy-7.3.18-alpha], pytest-2.9.2, py-1.4.29, pluggy-0.3.1
hypothesis profile 'default' -> deadline=None, database=DirectoryBasedExampleDatabase('d:\\pypy_stuff\\buildbot64\\slave\\own-win-x86-64\\build\\pypy\\.hypothesis\\examples')
pytest-2.9.2 from d:\pypy_stuff\buildbot64\slave\own-win-x86-64\build\pytest.pyc
rootdir: d:\pypy_stuff\buildbot64\slave\own-win-x86-64\build, inifile: pytest.ini
plugins: hypothesis-4.39.3
collected 0 items / 1 skipped
========================== 1 skipped in 0.02 seconds ==========================
++ 03:41:02 starting module/cpyext/test/test_bytearrayobject.py [45 started in total]
__ module/cpyext/test/test_bytearrayobject.py [42 done in total, somefailed=True]
INTERNALERROR> Traceback (most recent call last):
INTERNALERROR> File "d:\pypy_stuff\buildbot64\slave\own-win-x86-64\build\_pytest\main.py", line 90, in wrap_session
INTERNALERROR> config._do_configure()
INTERNALERROR> File "d:\pypy_stuff\buildbot64\slave\own-win-x86-64\build\_pytest\config.py", line 839, in _do_configure
INTERNALERROR> self.hook.pytest_configure.call_historic(kwargs=dict(config=self))
INTERNALERROR> File "d:\pypy_stuff\buildbot64\slave\own-win-x86-64\build\_pytest\vendored_packages\pluggy.py", line 729, in call_historic
INTERNALERROR> self._hookexec(self, self._nonwrappers + self._wrappers, kwargs)
INTERNALERROR> File "d:\pypy_stuff\buildbot64\slave\own-win-x86-64\build\_pytest\vendored_packages\pluggy.py", line 338, in _hookexec
INTERNALERROR> return self._inner_hookexec(hook, methods, kwargs)
INTERNALERROR> File "d:\pypy_stuff\buildbot64\slave\own-win-x86-64\build\_pytest\vendored_packages\pluggy.py", line 333, in <lambda>
INTERNALERROR> _MultiCall(methods, kwargs, hook.spec_opts).execute()
INTERNALERROR> File "d:\pypy_stuff\buildbot64\slave\own-win-x86-64\build\_pytest\vendored_packages\pluggy.py", line 596, in execute
INTERNALERROR> res = hook_impl.function(*args)
INTERNALERROR> File "d:\pypy_stuff\buildbot64\slave\own-win-x86-64\build\pypy\module\cpyext\test\conftest.py", line 37, in pytest_configure
INTERNALERROR> space = gettestobjspace(usemodules=['time'])
INTERNALERROR> File "d:\pypy_stuff\buildbot64\slave\own-win-x86-64\build\pypy\tool\pytest\objspace.py", line 25, in gettestobjspace
INTERNALERROR> space = maketestobjspace(config)
INTERNALERROR> File "d:\pypy_stuff\buildbot64\slave\own-win-x86-64\build\pypy\tool\pytest\objspace.py", line 35, in maketestobjspace
INTERNALERROR> space = make_objspace(config)
INTERNALERROR> File "d:\pypy_stuff\buildbot64\slave\own-win-x86-64\build\pypy\tool\option.py", line 33, in make_objspace
INTERNALERROR> return StdObjSpace(config)
INTERNALERROR> File "d:\pypy_stuff\buildbot64\slave\own-win-x86-64\build\pypy\interpreter\baseobjspace.py", line 467, in __init__
INTERNALERROR> self.initialize()
INTERNALERROR> File "d:\pypy_stuff\buildbot64\slave\own-win-x86-64\build\pypy\objspace\std\objspace.py", line 118, in initialize
INTERNALERROR> self.setup_builtin_modules()
INTERNALERROR> File "d:\pypy_stuff\buildbot64\slave\own-win-x86-64\build\pypy\interpreter\baseobjspace.py", line 713, in setup_builtin_modules
INTERNALERROR> mod.setup_after_space_initialization()
INTERNALERROR> File "d:\pypy_stuff\buildbot64\slave\own-win-x86-64\build\pypy\module\_warnings\moduledef.py", line 17, in setup_after_space_initialization
INTERNALERROR> state = self.space.fromcache(State)
INTERNALERROR> File "d:\pypy_stuff\buildbot64\slave\own-win-x86-64\build\rpython\rlib\cache.py", line 51, in getorbuild
INTERNALERROR> result = self._build(key)
INTERNALERROR> File "d:\pypy_stuff\buildbot64\slave\own-win-x86-64\build\pypy\interpreter\baseobjspace.py", line 402, in _build
INTERNALERROR> return callable(self.space)
INTERNALERROR> File "d:\pypy_stuff\buildbot64\slave\own-win-x86-64\build\pypy\module\_warnings\interp_warnings.py", line 13, in __init__
INTERNALERROR> self.init_filters(space)
INTERNALERROR> File "d:\pypy_stuff\buildbot64\slave\own-win-x86-64\build\pypy\module\_warnings\interp_warnings.py", line 20, in init_filters
INTERNALERROR> if (not space.sys.get_flag('py3k_warning') and
INTERNALERROR> File "d:\pypy_stuff\buildbot64\slave\own-win-x86-64\build\pypy\module\sys\moduledef.py", line 180, in get_flag
INTERNALERROR> return space.int_w(space.getattr(self.get('flags'), space.newtext(name)))
INTERNALERROR> File "d:\pypy_stuff\buildbot64\slave\own-win-x86-64\build\pypy\interpreter\mixedmodule.py", line 81, in get
INTERNALERROR> w_value = self.getdictvalue(space, name)
INTERNALERROR> File "d:\pypy_stuff\buildbot64\slave\own-win-x86-64\build\pypy\module\sys\moduledef.py", line 145, in getdictvalue
INTERNALERROR> value = MixedModule.getdictvalue(self, space, attr)
INTERNALERROR> File "d:\pypy_stuff\buildbot64\slave\own-win-x86-64\build\pypy\interpreter\mixedmodule.py", line 93, in getdictvalue
INTERNALERROR> return self._load_lazily(space, name)
INTERNALERROR> File "d:\pypy_stuff\buildbot64\slave\own-win-x86-64\build\pypy\interpreter\mixedmodule.py", line 103, in _load_lazily
INTERNALERROR> w_value = loader(space)
INTERNALERROR> File "d:\pypy_stuff\buildbot64\slave\own-win-x86-64\build\pypy\interpreter\mixedmodule.py", line 231, in afileloader
INTERNALERROR> return app.wget(space, attrname)
INTERNALERROR> File "d:\pypy_stuff\buildbot64\slave\own-win-x86-64\build\pypy\interpreter\gateway.py", line 1211, in wget
INTERNALERROR> w_globals = self.getwdict(space)
INTERNALERROR> File "d:\pypy_stuff\buildbot64\slave\own-win-x86-64\build\pypy\interpreter\gateway.py", line 1204, in getwdict
INTERNALERROR> return space.fromcache(ApplevelCache).getorbuild(self)
INTERNALERROR> File "d:\pypy_stuff\buildbot64\slave\own-win-x86-64\build\rpython\rlib\cache.py", line 51, in getorbuild
INTERNALERROR> result = self._build(key)
INTERNALERROR> File "d:\pypy_stuff\buildbot64\slave\own-win-x86-64\build\pypy\interpreter\baseobjspace.py", line 411, in _build
INTERNALERROR> return self.build(key)
INTERNALERROR> File "d:\pypy_stuff\buildbot64\slave\own-win-x86-64\build\pypy\interpreter\gateway.py", line 1255, in build
INTERNALERROR> return build_applevel_dict(app, self.space)
INTERNALERROR> File "d:\pypy_stuff\buildbot64\slave\own-win-x86-64\build\pypy\interpreter\gateway.py", line 1266, in build_applevel_dict
INTERNALERROR> filename=self.filename)
INTERNALERROR> File "d:\pypy_stuff\buildbot64\slave\own-win-x86-64\build\pypy\interpreter\baseobjspace.py", line 1403, in exec_
INTERNALERROR> return statement.exec_code(self, w_globals, w_locals)
INTERNALERROR> File "d:\pypy_stuff\buildbot64\slave\own-win-x86-64\build\pypy\interpreter\eval.py", line 33, in exec_code
INTERNALERROR> return frame.run()
INTERNALERROR> File "d:\pypy_stuff\buildbot64\slave\own-win-x86-64\build\pypy\interpreter\pyframe.py", line 253, in run
INTERNALERROR> return self.execute_frame(None, None)
INTERNALERROR> File "d:\pypy_stuff\buildbot64\slave\own-win-x86-64\build\pypy\interpreter\pyframe.py", line 290, in execute_frame
INTERNALERROR> raise self._convert_unexpected_exception(e)
INTERNALERROR> File "d:\pypy_stuff\buildbot64\slave\own-win-x86-64\build\pypy\interpreter\pyframe.py", line 943, in _convert_unexpected_exception
INTERNALERROR> operr = error.get_converted_unexpected_exception(self.space, e)
INTERNALERROR> File "d:\pypy_stuff\buildbot64\slave\own-win-x86-64\build\pypy\interpreter\pyframe.py", line 286, in execute_frame
INTERNALERROR> executioncontext)
INTERNALERROR> File "d:\pypy_stuff\buildbot64\slave\own-win-x86-64\build\pypy\interpreter\pyopcode.py", line 64, in dispatch
INTERNALERROR> next_instr = self.handle_bytecode(co_code, next_instr, ec)
INTERNALERROR> File "d:\pypy_stuff\buildbot64\slave\own-win-x86-64\build\pypy\interpreter\pyopcode.py", line 71, in handle_bytecode
INTERNALERROR> next_instr = self.dispatch_bytecode(co_code, next_instr, ec)
INTERNALERROR> File "d:\pypy_stuff\buildbot64\slave\own-win-x86-64\build\pypy\interpreter\pyopcode.py", line 322, in dispatch_bytecode
INTERNALERROR> self.IMPORT_NAME(oparg, next_instr)
INTERNALERROR> File "d:\pypy_stuff\buildbot64\slave\own-win-x86-64\build\pypy\interpreter\pyopcode.py", line 1065, in IMPORT_NAME
INTERNALERROR> w_locals, w_fromlist)
INTERNALERROR> File "d:\pypy_stuff\buildbot64\slave\own-win-x86-64\build\pypy\interpreter\baseobjspace.py", line 1210, in call_function
INTERNALERROR> return w_func.funccall(*args_w)
INTERNALERROR> File "d:\pypy_stuff\buildbot64\slave\own-win-x86-64\build\pypy\interpreter\function.py", line 124, in funccall
INTERNALERROR> return self.call_args(Arguments(self.space, list(args_w)))
INTERNALERROR> File "d:\pypy_stuff\buildbot64\slave\own-win-x86-64\build\pypy\interpreter\function.py", line 68, in call_args
INTERNALERROR> w_res = self.getcode().funcrun(self, args)
INTERNALERROR> File "d:\pypy_stuff\buildbot64\slave\own-win-x86-64\build\pypy\interpreter\gateway.py", line 781, in funcrun
INTERNALERROR> return BuiltinCode.funcrun_obj(self, func, None, args)
INTERNALERROR> File "d:\pypy_stuff\buildbot64\slave\own-win-x86-64\build\pypy\interpreter\gateway.py", line 795, in funcrun_obj
INTERNALERROR> self.handle_exception(space, e)
INTERNALERROR> File "d:\pypy_stuff\buildbot64\slave\own-win-x86-64\build\pypy\interpreter\gateway.py", line 819, in handle_exception
INTERNALERROR> raise error.get_converted_unexpected_exception(space, e)
INTERNALERROR> File "d:\pypy_stuff\buildbot64\slave\own-win-x86-64\build\pypy\interpreter\gateway.py", line 789, in funcrun_obj
INTERNALERROR> w_result = activation._run(space, scope_w)
INTERNALERROR> File "<2044-codegen d:\pypy_stuff\buildbot64\slave\own-win-x86-64\build\rpython\tool\sourcetools.py:200>", line 3, in _run
INTERNALERROR> return self.behavior(space, space.text0_w(scope_w[0]), scope_w[1], scope_w[2], scope_w[3], space.gateway_int_w(scope_w[4]))
INTERNALERROR> File "d:\pypy_stuff\buildbot64\slave\own-win-x86-64\build\pypy\module\imp\importing.py", line 293, in importhook
INTERNALERROR> w_fromlist, tentative=True)
INTERNALERROR> File "d:\pypy_stuff\buildbot64\slave\own-win-x86-64\build\pypy\module\imp\importing.py", line 317, in absolute_import
INTERNALERROR> w_fromlist, tentative)
INTERNALERROR> File "d:\pypy_stuff\buildbot64\slave\own-win-x86-64\build\pypy\module\imp\importing.py", line 326, in absolute_import_with_lock
INTERNALERROR> w_fromlist, tentative)
INTERNALERROR> File "d:\pypy_stuff\buildbot64\slave\own-win-x86-64\build\pypy\module\imp\importing.py", line 404, in _absolute_import
INTERNALERROR> tentative=tentative)
INTERNALERROR> File "d:\pypy_stuff\buildbot64\slave\own-win-x86-64\build\pypy\module\imp\importing.py", line 703, in load_part
INTERNALERROR> space, modulename, w_modulename, partname, w_path)
INTERNALERROR> File "d:\pypy_stuff\buildbot64\slave\own-win-x86-64\build\pypy\module\imp\importing.py", line 593, in find_module
INTERNALERROR> stream = streamio.open_file_as_stream(filename, filemode)
INTERNALERROR> File "d:\pypy_stuff\buildbot64\slave\own-win-x86-64\build\rpython\rlib\streamio.py", line 88, in open_file_as_stream
INTERNALERROR> stream = open_path_helper(path, os_flags, basemode == "a", signal_checker)
INTERNALERROR> File "d:\pypy_stuff\buildbot64\slave\own-win-x86-64\build\rpython\rlib\streamio.py", line 123, in open_path_helper
INTERNALERROR> fd = rposix.open(path, os_flags, 0666)
INTERNALERROR> File "d:\pypy_stuff\buildbot64\slave\own-win-x86-64\build\rpython\rlib\rposix.py", line 468, in open
INTERNALERROR> fd = c_wopen(buf, flags, mode)
INTERNALERROR> File "d:\pypy_stuff\buildbot64\slave\own-win-x86-64\build\rpython\rtyper\lltypesystem\rffi.py", line 321, in wrapper
INTERNALERROR> res = call_external_function(*real_args)
INTERNALERROR> File "<91-codegen d:\pypy_stuff\buildbot64\slave\own-win-x86-64\build\rpython\rtyper\lltypesystem\rffi.py:217>", line 19, in call_external_function
INTERNALERROR> rposix._errno_after(1)
INTERNALERROR> File "d:\pypy_stuff\buildbot64\slave\own-win-x86-64\build\rpython\rlib\rposix.py", line 192, in _errno_after
INTERNALERROR> rthread.tlfield_rpy_errno.setraw(_get_errno())
INTERNALERROR> File "d:\pypy_stuff\buildbot64\slave\own-win-x86-64\build\rpython\rtyper\lltypesystem\lltype.py", line 1384, in __call__
INTERNALERROR> return callb(*args)
INTERNALERROR> File "d:\pypy_stuff\buildbot64\slave\own-win-x86-64\build\rpython\rtyper\lltypesystem\ll2ctypes.py", line 1339, in __call__
INTERNALERROR> self.natural_arity)
INTERNALERROR> File "d:\pypy_stuff\buildbot64\slave\own-win-x86-64\build\rpython\rtyper\lltypesystem\ll2ctypes.py", line 1236, in get_ctypes_callable
INTERNALERROR> symbolic=True)
INTERNALERROR> File "d:\pypy_stuff\buildbot64\slave\own-win-x86-64\build\rpython\translator\tool\cbuild.py", line 345, in compile_shared_lib
INTERNALERROR> standalone=False))
INTERNALERROR> File "d:\pypy_stuff\buildbot64\slave\own-win-x86-64\build\rpython\translator\platform\__init__.py", line 57, in compile
INTERNALERROR> ofiles = self._compile_o_files(cfiles, eci, standalone)
INTERNALERROR> File "d:\pypy_stuff\buildbot64\slave\own-win-x86-64\build\rpython\translator\platform\__init__.py", line 79, in _compile_o_files
INTERNALERROR> ofiles.append(self._compile_c_file(self.cc, cfile, compile_args))
INTERNALERROR> File "d:\pypy_stuff\buildbot64\slave\own-win-x86-64\build\rpython\translator\platform\windows.py", line 290, in _compile_c_file
INTERNALERROR> self._execute_c_compiler(cc, args, oname)
INTERNALERROR> File "d:\pypy_stuff\buildbot64\slave\own-win-x86-64\build\rpython\translator\platform\__init__.py", line 143, in _execute_c_compiler
INTERNALERROR> self._handle_error(returncode, stdout, stderr, outname)
INTERNALERROR> File "d:\pypy_stuff\buildbot64\slave\own-win-x86-64\build\rpython\translator\platform\windows.py", line 319, in _handle_error
INTERNALERROR> raise CompilationError(stdout, stderr)
INTERNALERROR> CompilationError: CompilationError(out="""
INTERNALERROR> """)
++ 03:41:17 starting module/cpyext/test/test_bytesobject.py [46 started in total]
__ module/cpyext/test/test_borrow.py [43 done in total, somefailed=False] _____
============================= test session starts =============================
platform win32 -- Python 2.7.18[pypy-7.3.18-alpha], pytest-2.9.2, py-1.4.29, pluggy-0.3.1
hypothesis profile 'default' -> deadline=None, database=DirectoryBasedExampleDatabase('d:\\pypy_stuff\\buildbot64\\slave\\own-win-x86-64\\build\\pypy\\.hypothesis\\examples')
pytest-2.9.2 from d:\pypy_stuff\buildbot64\slave\own-win-x86-64\build\pytest.pyc
rootdir: d:\pypy_stuff\buildbot64\slave\own-win-x86-64\build, inifile: pytest.ini
plugins: hypothesis-4.39.3
collected 0 items / 1 skipped
========================== 1 skipped in 0.02 seconds ==========================
++ 03:41:17 starting module/cpyext/test/test_capsule.py [47 started in total]
__ module/cpyext/test/test_boolobject.py [44 done in total, somefailed=False] _
============================= test session starts =============================
platform win32 -- Python 2.7.18[pypy-7.3.18-alpha], pytest-2.9.2, py-1.4.29, pluggy-0.3.1
hypothesis profile 'default' -> deadline=None, database=DirectoryBasedExampleDatabase('d:\\pypy_stuff\\buildbot64\\slave\\own-win-x86-64\\build\\pypy\\.hypothesis\\examples')
pytest-2.9.2 from d:\pypy_stuff\buildbot64\slave\own-win-x86-64\build\pytest.pyc
rootdir: d:\pypy_stuff\buildbot64\slave\own-win-x86-64\build, inifile: pytest.ini
plugins: hypothesis-4.39.3
collected 0 items / 1 skipped
========================== 1 skipped in 0.02 seconds ==========================
++ 03:41:18 starting module/cpyext/test/test_cell.py [48 started in total]
__ module/cpyext/test/test_bufferobject.py [45 done in total, somefailed=False]
============================= test session starts =============================
platform win32 -- Python 2.7.18[pypy-7.3.18-alpha], pytest-2.9.2, py-1.4.29, pluggy-0.3.1
hypothesis profile 'default' -> deadline=None, database=DirectoryBasedExampleDatabase('d:\\pypy_stuff\\buildbot64\\slave\\own-win-x86-64\\build\\pypy\\.hypothesis\\examples')
pytest-2.9.2 from d:\pypy_stuff\buildbot64\slave\own-win-x86-64\build\pytest.pyc
rootdir: d:\pypy_stuff\buildbot64\slave\own-win-x86-64\build, inifile: pytest.ini
plugins: hypothesis-4.39.3
collected 0 items / 1 skipped
========================== 1 skipped in 0.02 seconds ==========================
++ 03:41:19 starting module/cpyext/test/test_classobject.py [49 started in total]
__ module/cpyext/test/test_classobject.py [46 done in total, somefailed=False]
============================= test session starts =============================
platform win32 -- Python 2.7.18[pypy-7.3.18-alpha], pytest-2.9.2, py-1.4.29, pluggy-0.3.1
hypothesis profile 'default' -> deadline=None, database=DirectoryBasedExampleDatabase('d:\\pypy_stuff\\buildbot64\\slave\\own-win-x86-64\\build\\pypy\\.hypothesis\\examples')
pytest-2.9.2 from d:\pypy_stuff\buildbot64\slave\own-win-x86-64\build\pytest.pyc
rootdir: d:\pypy_stuff\buildbot64\slave\own-win-x86-64\build, inifile: pytest.ini
plugins: hypothesis-4.39.3
collected 0 items / 1 skipped
========================== 1 skipped in 0.02 seconds ==========================
++ 03:41:40 starting module/cpyext/test/test_codecs.py [50 started in total]
__ module/cpyext/test/test_bytesobject.py [47 done in total, somefailed=False]
============================= test session starts =============================
platform win32 -- Python 2.7.18[pypy-7.3.18-alpha], pytest-2.9.2, py-1.4.29, pluggy-0.3.1
hypothesis profile 'default' -> deadline=None, database=DirectoryBasedExampleDatabase('d:\\pypy_stuff\\buildbot64\\slave\\own-win-x86-64\\build\\pypy\\.hypothesis\\examples')
pytest-2.9.2 from d:\pypy_stuff\buildbot64\slave\own-win-x86-64\build\pytest.pyc
rootdir: d:\pypy_stuff\buildbot64\slave\own-win-x86-64\build, inifile: pytest.ini
plugins: hypothesis-4.39.3
collected 0 items / 1 skipped
========================== 1 skipped in 0.02 seconds ==========================
++ 03:41:41 starting module/cpyext/test/test_complexobject.py [51 started in total]
__ module/cpyext/test/test_capsule.py [48 done in total, somefailed=False] ____
============================= test session starts =============================
platform win32 -- Python 2.7.18[pypy-7.3.18-alpha], pytest-2.9.2, py-1.4.29, pluggy-0.3.1
hypothesis profile 'default' -> deadline=None, database=DirectoryBasedExampleDatabase('d:\\pypy_stuff\\buildbot64\\slave\\own-win-x86-64\\build\\pypy\\.hypothesis\\examples')
pytest-2.9.2 from d:\pypy_stuff\buildbot64\slave\own-win-x86-64\build\pytest.pyc
rootdir: d:\pypy_stuff\buildbot64\slave\own-win-x86-64\build, inifile: pytest.ini
plugins: hypothesis-4.39.3
collected 0 items / 1 skipped
========================== 1 skipped in 0.02 seconds ==========================
++ 03:41:42 starting module/cpyext/test/test_cpyext.py [52 started in total]
__ module/cpyext/test/test_cell.py [49 done in total, somefailed=False] _______
============================= test session starts =============================
platform win32 -- Python 2.7.18[pypy-7.3.18-alpha], pytest-2.9.2, py-1.4.29, pluggy-0.3.1
hypothesis profile 'default' -> deadline=None, database=DirectoryBasedExampleDatabase('d:\\pypy_stuff\\buildbot64\\slave\\own-win-x86-64\\build\\pypy\\.hypothesis\\examples')
pytest-2.9.2 from d:\pypy_stuff\buildbot64\slave\own-win-x86-64\build\pytest.pyc
rootdir: d:\pypy_stuff\buildbot64\slave\own-win-x86-64\build, inifile: pytest.ini
plugins: hypothesis-4.39.3
collected 0 items / 1 skipped
========================== 1 skipped in 0.02 seconds ==========================
++ 03:41:42 starting module/cpyext/test/test_datetime.py [53 started in total]
__ module/cpyext/test/test_complexobject.py [50 done in total, somefailed=True]
INTERNALERROR> Traceback (most recent call last):
INTERNALERROR> File "d:\pypy_stuff\buildbot64\slave\own-win-x86-64\build\_pytest\main.py", line 90, in wrap_session
INTERNALERROR> config._do_configure()
INTERNALERROR> File "d:\pypy_stuff\buildbot64\slave\own-win-x86-64\build\_pytest\config.py", line 839, in _do_configure
INTERNALERROR> self.hook.pytest_configure.call_historic(kwargs=dict(config=self))
INTERNALERROR> File "d:\pypy_stuff\buildbot64\slave\own-win-x86-64\build\_pytest\vendored_packages\pluggy.py", line 729, in call_historic
INTERNALERROR> self._hookexec(self, self._nonwrappers + self._wrappers, kwargs)
INTERNALERROR> File "d:\pypy_stuff\buildbot64\slave\own-win-x86-64\build\_pytest\vendored_packages\pluggy.py", line 338, in _hookexec
INTERNALERROR> return self._inner_hookexec(hook, methods, kwargs)
INTERNALERROR> File "d:\pypy_stuff\buildbot64\slave\own-win-x86-64\build\_pytest\vendored_packages\pluggy.py", line 333, in <lambda>
INTERNALERROR> _MultiCall(methods, kwargs, hook.spec_opts).execute()
INTERNALERROR> File "d:\pypy_stuff\buildbot64\slave\own-win-x86-64\build\_pytest\vendored_packages\pluggy.py", line 596, in execute
INTERNALERROR> res = hook_impl.function(*args)
INTERNALERROR> File "d:\pypy_stuff\buildbot64\slave\own-win-x86-64\build\pypy\module\cpyext\test\conftest.py", line 41, in pytest_configure
INTERNALERROR> import pypy.module.cpyext.test.test_cpyext
INTERNALERROR> File "d:\pypy_stuff\buildbot64\slave\own-win-x86-64\build\pypy\module\cpyext\test\test_cpyext.py", line 9, in <module>
INTERNALERROR> from pypy.module.cpyext import api
INTERNALERROR> File "d:\pypy_stuff\buildbot64\slave\own-win-x86-64\build\pypy\module\cpyext\api.py", line 153, in <module>
INTERNALERROR> globals().update(rffi_platform.configure(CConfig_constants))
INTERNALERROR> File "d:\pypy_stuff\buildbot64\slave\own-win-x86-64\build\rpython\rtyper\tool\rffi_platform.py", line 216, in configure
INTERNALERROR> for name, result in zip(entries, results):
INTERNALERROR> File "d:\pypy_stuff\buildbot64\slave\own-win-x86-64\build\rpython\rtyper\tool\rffi_platform.py", line 241, in configure_entries
INTERNALERROR> writer.path, eci, ignore_errors=ignore_errors))
INTERNALERROR> File "d:\pypy_stuff\buildbot64\slave\own-win-x86-64\build\rpython\rtyper\tool\rffi_platform.py", line 745, in run_example_code
INTERNALERROR> output = build_executable_cache(files, eci, ignore_errors=ignore_errors)
INTERNALERROR> File "d:\pypy_stuff\buildbot64\slave\own-win-x86-64\build\rpython\tool\gcc_cache.py", line 28, in build_executable_cache
INTERNALERROR> result = platform.execute(platform.compile(c_files, eci))
INTERNALERROR> File "d:\pypy_stuff\buildbot64\slave\own-win-x86-64\build\rpython\translator\platform\__init__.py", line 58, in compile
INTERNALERROR> return self._finish_linking(ofiles, eci, outputfilename, standalone)
INTERNALERROR> File "d:\pypy_stuff\buildbot64\slave\own-win-x86-64\build\rpython\translator\platform\__init__.py", line 235, in _finish_linking
INTERNALERROR> return self._link(cc_link, ofiles, largs, standalone, exe_name)
INTERNALERROR> File "d:\pypy_stuff\buildbot64\slave\own-win-x86-64\build\rpython\translator\platform\windows.py", line 303, in _link
INTERNALERROR> self._execute_c_compiler(self.link, args, exe_name)
INTERNALERROR> File "d:\pypy_stuff\buildbot64\slave\own-win-x86-64\build\rpython\translator\platform\__init__.py", line 143, in _execute_c_compiler
INTERNALERROR> self._handle_error(returncode, stdout, stderr, outname)
INTERNALERROR> File "d:\pypy_stuff\buildbot64\slave\own-win-x86-64\build\rpython\translator\platform\windows.py", line 319, in _handle_error
INTERNALERROR> raise CompilationError(stdout, stderr)
INTERNALERROR> CompilationError: CompilationError(out="""
INTERNALERROR> """)
++ 03:42:02 starting module/cpyext/test/test_dictobject.py [54 started in total]
__ module/cpyext/test/test_datetime.py [51 done in total, somefailed=False] ___
============================= test session starts =============================
platform win32 -- Python 2.7.18[pypy-7.3.18-alpha], pytest-2.9.2, py-1.4.29, pluggy-0.3.1
hypothesis profile 'default' -> deadline=None, database=DirectoryBasedExampleDatabase('d:\\pypy_stuff\\buildbot64\\slave\\own-win-x86-64\\build\\pypy\\.hypothesis\\examples')
pytest-2.9.2 from d:\pypy_stuff\buildbot64\slave\own-win-x86-64\build\pytest.pyc
rootdir: d:\pypy_stuff\buildbot64\slave\own-win-x86-64\build, inifile: pytest.ini
plugins: hypothesis-4.39.3
collected 0 items / 1 skipped
========================== 1 skipped in 0.02 seconds ==========================
++ 03:42:03 starting module/cpyext/test/test_eval.py [55 started in total]
__ module/cpyext/test/test_cpyext.py [52 done in total, somefailed=False] _____
============================= test session starts =============================
platform win32 -- Python 2.7.18[pypy-7.3.18-alpha], pytest-2.9.2, py-1.4.29, pluggy-0.3.1
hypothesis profile 'default' -> deadline=None, database=DirectoryBasedExampleDatabase('d:\\pypy_stuff\\buildbot64\\slave\\own-win-x86-64\\build\\pypy\\.hypothesis\\examples')
pytest-2.9.2 from d:\pypy_stuff\buildbot64\slave\own-win-x86-64\build\pytest.pyc
rootdir: d:\pypy_stuff\buildbot64\slave\own-win-x86-64\build, inifile: pytest.ini
plugins: hypothesis-4.39.3
collected 0 items / 1 skipped
========================== 1 skipped in 0.02 seconds ==========================
++ 03:42:03 starting module/cpyext/test/test_fileobject.py [56 started in total]
__ module/cpyext/test/test_codecs.py [53 done in total, somefailed=False] _____
============================= test session starts =============================
platform win32 -- Python 2.7.18[pypy-7.3.18-alpha], pytest-2.9.2, py-1.4.29, pluggy-0.3.1
hypothesis profile 'default' -> deadline=None, database=DirectoryBasedExampleDatabase('d:\\pypy_stuff\\buildbot64\\slave\\own-win-x86-64\\build\\pypy\\.hypothesis\\examples')
pytest-2.9.2 from d:\pypy_stuff\buildbot64\slave\own-win-x86-64\build\pytest.pyc
rootdir: d:\pypy_stuff\buildbot64\slave\own-win-x86-64\build, inifile: pytest.ini
plugins: hypothesis-4.39.3
collected 0 items / 1 skipped
========================== 1 skipped in 0.02 seconds ==========================
++ 03:42:05 starting module/cpyext/test/test_floatobject.py [57 started in total]
__ module/cpyext/test/test_fileobject.py [54 done in total, somefailed=False] _
============================= test session starts =============================
platform win32 -- Python 2.7.18[pypy-7.3.18-alpha], pytest-2.9.2, py-1.4.29, pluggy-0.3.1
hypothesis profile 'default' -> deadline=None, database=DirectoryBasedExampleDatabase('d:\\pypy_stuff\\buildbot64\\slave\\own-win-x86-64\\build\\pypy\\.hypothesis\\examples')
pytest-2.9.2 from d:\pypy_stuff\buildbot64\slave\own-win-x86-64\build\pytest.pyc
rootdir: d:\pypy_stuff\buildbot64\slave\own-win-x86-64\build, inifile: pytest.ini
plugins: hypothesis-4.39.3
collected 0 items / 1 skipped
========================== 1 skipped in 0.02 seconds ==========================
++ 03:42:24 starting module/cpyext/test/test_frameobject.py [58 started in total]
__ module/cpyext/test/test_floatobject.py [55 done in total, somefailed=False]
============================= test session starts =============================
platform win32 -- Python 2.7.18[pypy-7.3.18-alpha], pytest-2.9.2, py-1.4.29, pluggy-0.3.1
hypothesis profile 'default' -> deadline=None, database=DirectoryBasedExampleDatabase('d:\\pypy_stuff\\buildbot64\\slave\\own-win-x86-64\\build\\pypy\\.hypothesis\\examples')
pytest-2.9.2 from d:\pypy_stuff\buildbot64\slave\own-win-x86-64\build\pytest.pyc
rootdir: d:\pypy_stuff\buildbot64\slave\own-win-x86-64\build, inifile: pytest.ini
plugins: hypothesis-4.39.3
collected 0 items / 1 skipped
========================== 1 skipped in 0.02 seconds ==========================
++ 03:42:26 starting module/cpyext/test/test_funcobject.py [59 started in total]
__ module/cpyext/test/test_dictobject.py [56 done in total, somefailed=False] _
============================= test session starts =============================
platform win32 -- Python 2.7.18[pypy-7.3.18-alpha], pytest-2.9.2, py-1.4.29, pluggy-0.3.1
hypothesis profile 'default' -> deadline=None, database=DirectoryBasedExampleDatabase('d:\\pypy_stuff\\buildbot64\\slave\\own-win-x86-64\\build\\pypy\\.hypothesis\\examples')
pytest-2.9.2 from d:\pypy_stuff\buildbot64\slave\own-win-x86-64\build\pytest.pyc
rootdir: d:\pypy_stuff\buildbot64\slave\own-win-x86-64\build, inifile: pytest.ini
plugins: hypothesis-4.39.3
collected 0 items / 1 skipped
========================== 1 skipped in 0.02 seconds ==========================
++ 03:42:26 starting module/cpyext/test/test_genobject.py [60 started in total]
__ module/cpyext/test/test_eval.py [57 done in total, somefailed=False] _______
============================= test session starts =============================
platform win32 -- Python 2.7.18[pypy-7.3.18-alpha], pytest-2.9.2, py-1.4.29, pluggy-0.3.1
hypothesis profile 'default' -> deadline=None, database=DirectoryBasedExampleDatabase('d:\\pypy_stuff\\buildbot64\\slave\\own-win-x86-64\\build\\pypy\\.hypothesis\\examples')
pytest-2.9.2 from d:\pypy_stuff\buildbot64\slave\own-win-x86-64\build\pytest.pyc
rootdir: d:\pypy_stuff\buildbot64\slave\own-win-x86-64\build, inifile: pytest.ini
plugins: hypothesis-4.39.3
collected 0 items / 1 skipped
========================== 1 skipped in 0.02 seconds ==========================
++ 03:42:27 starting module/cpyext/test/test_getargs.py [61 started in total]
__ module/cpyext/test/test_getargs.py [58 done in total, somefailed=False] ____
============================= test session starts =============================
platform win32 -- Python 2.7.18[pypy-7.3.18-alpha], pytest-2.9.2, py-1.4.29, pluggy-0.3.1
hypothesis profile 'default' -> deadline=None, database=DirectoryBasedExampleDatabase('d:\\pypy_stuff\\buildbot64\\slave\\own-win-x86-64\\build\\pypy\\.hypothesis\\examples')
pytest-2.9.2 from d:\pypy_stuff\buildbot64\slave\own-win-x86-64\build\pytest.pyc
rootdir: d:\pypy_stuff\buildbot64\slave\own-win-x86-64\build, inifile: pytest.ini
plugins: hypothesis-4.39.3
collected 0 items / 1 skipped
========================== 1 skipped in 0.02 seconds ==========================
++ 03:42:48 starting module/cpyext/test/test_import.py [62 started in total]
__ module/cpyext/test/test_frameobject.py [59 done in total, somefailed=False]
============================= test session starts =============================
platform win32 -- Python 2.7.18[pypy-7.3.18-alpha], pytest-2.9.2, py-1.4.29, pluggy-0.3.1
hypothesis profile 'default' -> deadline=None, database=DirectoryBasedExampleDatabase('d:\\pypy_stuff\\buildbot64\\slave\\own-win-x86-64\\build\\pypy\\.hypothesis\\examples')
pytest-2.9.2 from d:\pypy_stuff\buildbot64\slave\own-win-x86-64\build\pytest.pyc
rootdir: d:\pypy_stuff\buildbot64\slave\own-win-x86-64\build, inifile: pytest.ini
plugins: hypothesis-4.39.3
collected 0 items / 1 skipped
========================== 1 skipped in 0.02 seconds ==========================
++ 03:42:49 starting module/cpyext/test/test_intobject.py [63 started in total]
__ module/cpyext/test/test_funcobject.py [60 done in total, somefailed=False] _
============================= test session starts =============================
platform win32 -- Python 2.7.18[pypy-7.3.18-alpha], pytest-2.9.2, py-1.4.29, pluggy-0.3.1
hypothesis profile 'default' -> deadline=None, database=DirectoryBasedExampleDatabase('d:\\pypy_stuff\\buildbot64\\slave\\own-win-x86-64\\build\\pypy\\.hypothesis\\examples')
pytest-2.9.2 from d:\pypy_stuff\buildbot64\slave\own-win-x86-64\build\pytest.pyc
rootdir: d:\pypy_stuff\buildbot64\slave\own-win-x86-64\build, inifile: pytest.ini
plugins: hypothesis-4.39.3
collected 0 items / 1 skipped
========================== 1 skipped in 0.02 seconds ==========================
++ 03:42:50 starting module/cpyext/test/test_iterator.py [64 started in total]
__ module/cpyext/test/test_genobject.py [61 done in total, somefailed=False] __
============================= test session starts =============================
platform win32 -- Python 2.7.18[pypy-7.3.18-alpha], pytest-2.9.2, py-1.4.29, pluggy-0.3.1
hypothesis profile 'default' -> deadline=None, database=DirectoryBasedExampleDatabase('d:\\pypy_stuff\\buildbot64\\slave\\own-win-x86-64\\build\\pypy\\.hypothesis\\examples')
pytest-2.9.2 from d:\pypy_stuff\buildbot64\slave\own-win-x86-64\build\pytest.pyc
rootdir: d:\pypy_stuff\buildbot64\slave\own-win-x86-64\build, inifile: pytest.ini
plugins: hypothesis-4.39.3
collected 0 items / 1 skipped
========================== 1 skipped in 0.02 seconds ==========================
++ 03:42:50 starting module/cpyext/test/test_listobject.py [65 started in total]
__ module/cpyext/test/test_iterator.py [62 done in total, somefailed=False] ___
============================= test session starts =============================
platform win32 -- Python 2.7.18[pypy-7.3.18-alpha], pytest-2.9.2, py-1.4.29, pluggy-0.3.1
hypothesis profile 'default' -> deadline=None, database=DirectoryBasedExampleDatabase('d:\\pypy_stuff\\buildbot64\\slave\\own-win-x86-64\\build\\pypy\\.hypothesis\\examples')
pytest-2.9.2 from d:\pypy_stuff\buildbot64\slave\own-win-x86-64\build\pytest.pyc
rootdir: d:\pypy_stuff\buildbot64\slave\own-win-x86-64\build, inifile: pytest.ini
plugins: hypothesis-4.39.3
collected 0 items / 1 skipped
========================== 1 skipped in 0.01 seconds ==========================
++ 03:43:11 starting module/cpyext/test/test_longobject.py [66 started in total]
__ module/cpyext/test/test_listobject.py [63 done in total, somefailed=False] _
============================= test session starts =============================
platform win32 -- Python 2.7.18[pypy-7.3.18-alpha], pytest-2.9.2, py-1.4.29, pluggy-0.3.1
hypothesis profile 'default' -> deadline=None, database=DirectoryBasedExampleDatabase('d:\\pypy_stuff\\buildbot64\\slave\\own-win-x86-64\\build\\pypy\\.hypothesis\\examples')
pytest-2.9.2 from d:\pypy_stuff\buildbot64\slave\own-win-x86-64\build\pytest.pyc
rootdir: d:\pypy_stuff\buildbot64\slave\own-win-x86-64\build, inifile: pytest.ini
plugins: hypothesis-4.39.3
collected 0 items / 1 skipped
========================== 1 skipped in 0.02 seconds ==========================
++ 03:43:12 starting module/cpyext/test/test_mapping.py [67 started in total]
__ module/cpyext/test/test_intobject.py [64 done in total, somefailed=False] __
============================= test session starts =============================
platform win32 -- Python 2.7.18[pypy-7.3.18-alpha], pytest-2.9.2, py-1.4.29, pluggy-0.3.1
hypothesis profile 'default' -> deadline=None, database=DirectoryBasedExampleDatabase('d:\\pypy_stuff\\buildbot64\\slave\\own-win-x86-64\\build\\pypy\\.hypothesis\\examples')
pytest-2.9.2 from d:\pypy_stuff\buildbot64\slave\own-win-x86-64\build\pytest.pyc
rootdir: d:\pypy_stuff\buildbot64\slave\own-win-x86-64\build, inifile: pytest.ini
plugins: hypothesis-4.39.3
collected 0 items / 1 skipped
========================== 1 skipped in 0.02 seconds ==========================
++ 03:43:13 starting module/cpyext/test/test_marshal.py [68 started in total]
__ module/cpyext/test/test_import.py [65 done in total, somefailed=False] _____
============================= test session starts =============================
platform win32 -- Python 2.7.18[pypy-7.3.18-alpha], pytest-2.9.2, py-1.4.29, pluggy-0.3.1
hypothesis profile 'default' -> deadline=None, database=DirectoryBasedExampleDatabase('d:\\pypy_stuff\\buildbot64\\slave\\own-win-x86-64\\build\\pypy\\.hypothesis\\examples')
pytest-2.9.2 from d:\pypy_stuff\buildbot64\slave\own-win-x86-64\build\pytest.pyc
rootdir: d:\pypy_stuff\buildbot64\slave\own-win-x86-64\build, inifile: pytest.ini
plugins: hypothesis-4.39.3
collected 0 items / 1 skipped
========================== 1 skipped in 0.02 seconds ==========================
++ 03:43:13 starting module/cpyext/test/test_memoryobject.py [69 started in total]
__ module/cpyext/test/test_memoryobject.py [66 done in total, somefailed=False]
============================= test session starts =============================
platform win32 -- Python 2.7.18[pypy-7.3.18-alpha], pytest-2.9.2, py-1.4.29, pluggy-0.3.1
hypothesis profile 'default' -> deadline=None, database=DirectoryBasedExampleDatabase('d:\\pypy_stuff\\buildbot64\\slave\\own-win-x86-64\\build\\pypy\\.hypothesis\\examples')
pytest-2.9.2 from d:\pypy_stuff\buildbot64\slave\own-win-x86-64\build\pytest.pyc
rootdir: d:\pypy_stuff\buildbot64\slave\own-win-x86-64\build, inifile: pytest.ini
plugins: hypothesis-4.39.3
collected 0 items / 1 skipped
========================== 1 skipped in 0.02 seconds ==========================
++ 03:43:34 starting module/cpyext/test/test_methodobject.py [70 started in total]
__ module/cpyext/test/test_marshal.py [67 done in total, somefailed=False] ____
============================= test session starts =============================
platform win32 -- Python 2.7.18[pypy-7.3.18-alpha], pytest-2.9.2, py-1.4.29, pluggy-0.3.1
hypothesis profile 'default' -> deadline=None, database=DirectoryBasedExampleDatabase('d:\\pypy_stuff\\buildbot64\\slave\\own-win-x86-64\\build\\pypy\\.hypothesis\\examples')
pytest-2.9.2 from d:\pypy_stuff\buildbot64\slave\own-win-x86-64\build\pytest.pyc
rootdir: d:\pypy_stuff\buildbot64\slave\own-win-x86-64\build, inifile: pytest.ini
plugins: hypothesis-4.39.3
collected 0 items / 1 skipped
========================== 1 skipped in 0.02 seconds ==========================
++ 03:43:34 starting module/cpyext/test/test_misc.py [71 started in total]
__ module/cpyext/test/test_longobject.py [68 done in total, somefailed=False] _
============================= test session starts =============================
platform win32 -- Python 2.7.18[pypy-7.3.18-alpha], pytest-2.9.2, py-1.4.29, pluggy-0.3.1
hypothesis profile 'default' -> deadline=None, database=DirectoryBasedExampleDatabase('d:\\pypy_stuff\\buildbot64\\slave\\own-win-x86-64\\build\\pypy\\.hypothesis\\examples')
pytest-2.9.2 from d:\pypy_stuff\buildbot64\slave\own-win-x86-64\build\pytest.pyc
rootdir: d:\pypy_stuff\buildbot64\slave\own-win-x86-64\build, inifile: pytest.ini
plugins: hypothesis-4.39.3
collected 0 items / 1 skipped
========================== 1 skipped in 0.02 seconds ==========================
++ 03:43:36 starting module/cpyext/test/test_module.py [72 started in total]
__ module/cpyext/test/test_mapping.py [69 done in total, somefailed=False] ____
============================= test session starts =============================
platform win32 -- Python 2.7.18[pypy-7.3.18-alpha], pytest-2.9.2, py-1.4.29, pluggy-0.3.1
hypothesis profile 'default' -> deadline=None, database=DirectoryBasedExampleDatabase('d:\\pypy_stuff\\buildbot64\\slave\\own-win-x86-64\\build\\pypy\\.hypothesis\\examples')
pytest-2.9.2 from d:\pypy_stuff\buildbot64\slave\own-win-x86-64\build\pytest.pyc
rootdir: d:\pypy_stuff\buildbot64\slave\own-win-x86-64\build, inifile: pytest.ini
plugins: hypothesis-4.39.3
collected 0 items / 1 skipped
========================== 1 skipped in 0.02 seconds ==========================
++ 03:43:36 starting module/cpyext/test/test_ndarrayobject.py [73 started in total]
__ module/cpyext/test/test_module.py [70 done in total, somefailed=False] _____
============================= test session starts =============================
platform win32 -- Python 2.7.18[pypy-7.3.18-alpha], pytest-2.9.2, py-1.4.29, pluggy-0.3.1
hypothesis profile 'default' -> deadline=None, database=DirectoryBasedExampleDatabase('d:\\pypy_stuff\\buildbot64\\slave\\own-win-x86-64\\build\\pypy\\.hypothesis\\examples')
pytest-2.9.2 from d:\pypy_stuff\buildbot64\slave\own-win-x86-64\build\pytest.pyc
rootdir: d:\pypy_stuff\buildbot64\slave\own-win-x86-64\build, inifile: pytest.ini
plugins: hypothesis-4.39.3
collected 0 items / 1 skipped
========================== 1 skipped in 0.02 seconds ==========================
++ 03:43:57 starting module/cpyext/test/test_number.py [74 started in total]
__ module/cpyext/test/test_ndarrayobject.py [71 done in total, somefailed=False]
============================= test session starts =============================
platform win32 -- Python 2.7.18[pypy-7.3.18-alpha], pytest-2.9.2, py-1.4.29, pluggy-0.3.1
hypothesis profile 'default' -> deadline=None, database=DirectoryBasedExampleDatabase('d:\\pypy_stuff\\buildbot64\\slave\\own-win-x86-64\\build\\pypy\\.hypothesis\\examples')
pytest-2.9.2 from d:\pypy_stuff\buildbot64\slave\own-win-x86-64\build\pytest.pyc
rootdir: d:\pypy_stuff\buildbot64\slave\own-win-x86-64\build, inifile: pytest.ini
plugins: hypothesis-4.39.3
collected 0 items / 1 skipped
========================== 1 skipped in 0.02 seconds ==========================
++ 03:43:57 starting module/cpyext/test/test_object.py [75 started in total]
__ module/cpyext/test/test_methodobject.py [72 done in total, somefailed=False]
============================= test session starts =============================
platform win32 -- Python 2.7.18[pypy-7.3.18-alpha], pytest-2.9.2, py-1.4.29, pluggy-0.3.1
hypothesis profile 'default' -> deadline=None, database=DirectoryBasedExampleDatabase('d:\\pypy_stuff\\buildbot64\\slave\\own-win-x86-64\\build\\pypy\\.hypothesis\\examples')
pytest-2.9.2 from d:\pypy_stuff\buildbot64\slave\own-win-x86-64\build\pytest.pyc
rootdir: d:\pypy_stuff\buildbot64\slave\own-win-x86-64\build, inifile: pytest.ini
plugins: hypothesis-4.39.3
collected 0 items / 1 skipped
========================== 1 skipped in 0.01 seconds ==========================
++ 03:43:59 starting module/cpyext/test/test_pycobject.py [76 started in total]
__ module/cpyext/test/test_misc.py [73 done in total, somefailed=False] _______
============================= test session starts =============================
platform win32 -- Python 2.7.18[pypy-7.3.18-alpha], pytest-2.9.2, py-1.4.29, pluggy-0.3.1
hypothesis profile 'default' -> deadline=None, database=DirectoryBasedExampleDatabase('d:\\pypy_stuff\\buildbot64\\slave\\own-win-x86-64\\build\\pypy\\.hypothesis\\examples')
pytest-2.9.2 from d:\pypy_stuff\buildbot64\slave\own-win-x86-64\build\pytest.pyc
rootdir: d:\pypy_stuff\buildbot64\slave\own-win-x86-64\build, inifile: pytest.ini
plugins: hypothesis-4.39.3
collected 0 items / 1 skipped
========================== 1 skipped in 0.02 seconds ==========================
++ 03:43:59 starting module/cpyext/test/test_pyerrors.py [77 started in total]
__ module/cpyext/test/test_pyerrors.py [74 done in total, somefailed=False] ___
============================= test session starts =============================
platform win32 -- Python 2.7.18[pypy-7.3.18-alpha], pytest-2.9.2, py-1.4.29, pluggy-0.3.1
hypothesis profile 'default' -> deadline=None, database=DirectoryBasedExampleDatabase('d:\\pypy_stuff\\buildbot64\\slave\\own-win-x86-64\\build\\pypy\\.hypothesis\\examples')
pytest-2.9.2 from d:\pypy_stuff\buildbot64\slave\own-win-x86-64\build\pytest.pyc
rootdir: d:\pypy_stuff\buildbot64\slave\own-win-x86-64\build, inifile: pytest.ini
plugins: hypothesis-4.39.3
collected 0 items / 1 skipped
========================== 1 skipped in 0.02 seconds ==========================
++ 03:44:20 starting module/cpyext/test/test_pyfile.py [78 started in total]
__ module/cpyext/test/test_object.py [75 done in total, somefailed=False] _____
============================= test session starts =============================
platform win32 -- Python 2.7.18[pypy-7.3.18-alpha], pytest-2.9.2, py-1.4.29, pluggy-0.3.1
hypothesis profile 'default' -> deadline=None, database=DirectoryBasedExampleDatabase('d:\\pypy_stuff\\buildbot64\\slave\\own-win-x86-64\\build\\pypy\\.hypothesis\\examples')
pytest-2.9.2 from d:\pypy_stuff\buildbot64\slave\own-win-x86-64\build\pytest.pyc
rootdir: d:\pypy_stuff\buildbot64\slave\own-win-x86-64\build, inifile: pytest.ini
plugins: hypothesis-4.39.3
collected 0 items / 1 skipped
========================== 1 skipped in 0.02 seconds ==========================
++ 03:44:22 starting module/cpyext/test/test_pysignals.py [79 started in total]
__ module/cpyext/test/test_number.py [76 done in total, somefailed=False] _____
============================= test session starts =============================
platform win32 -- Python 2.7.18[pypy-7.3.18-alpha], pytest-2.9.2, py-1.4.29, pluggy-0.3.1
hypothesis profile 'default' -> deadline=None, database=DirectoryBasedExampleDatabase('d:\\pypy_stuff\\buildbot64\\slave\\own-win-x86-64\\build\\pypy\\.hypothesis\\examples')
pytest-2.9.2 from d:\pypy_stuff\buildbot64\slave\own-win-x86-64\build\pytest.pyc
rootdir: d:\pypy_stuff\buildbot64\slave\own-win-x86-64\build, inifile: pytest.ini
plugins: hypothesis-4.39.3
collected 0 items / 1 skipped
========================== 1 skipped in 0.02 seconds ==========================
++ 03:44:22 starting module/cpyext/test/test_pystate.py [80 started in total]
__ module/cpyext/test/test_pycobject.py [77 done in total, somefailed=False] __
============================= test session starts =============================
platform win32 -- Python 2.7.18[pypy-7.3.18-alpha], pytest-2.9.2, py-1.4.29, pluggy-0.3.1
hypothesis profile 'default' -> deadline=None, database=DirectoryBasedExampleDatabase('d:\\pypy_stuff\\buildbot64\\slave\\own-win-x86-64\\build\\pypy\\.hypothesis\\examples')
pytest-2.9.2 from d:\pypy_stuff\buildbot64\slave\own-win-x86-64\build\pytest.pyc
rootdir: d:\pypy_stuff\buildbot64\slave\own-win-x86-64\build, inifile: pytest.ini
plugins: hypothesis-4.39.3
collected 0 items / 1 skipped
========================== 1 skipped in 0.02 seconds ==========================
++ 03:44:23 starting module/cpyext/test/test_pystrtod.py [81 started in total]
__ module/cpyext/test/test_pystate.py [78 done in total, somefailed=False] ____
============================= test session starts =============================
platform win32 -- Python 2.7.18[pypy-7.3.18-alpha], pytest-2.9.2, py-1.4.29, pluggy-0.3.1
hypothesis profile 'default' -> deadline=None, database=DirectoryBasedExampleDatabase('d:\\pypy_stuff\\buildbot64\\slave\\own-win-x86-64\\build\\pypy\\.hypothesis\\examples')
pytest-2.9.2 from d:\pypy_stuff\buildbot64\slave\own-win-x86-64\build\pytest.pyc
rootdir: d:\pypy_stuff\buildbot64\slave\own-win-x86-64\build, inifile: pytest.ini
plugins: hypothesis-4.39.3
collected 0 items / 1 skipped
========================== 1 skipped in 0.02 seconds ==========================
++ 03:44:43 starting module/cpyext/test/test_sequence.py [82 started in total]
__ module/cpyext/test/test_pyfile.py [79 done in total, somefailed=False] _____
============================= test session starts =============================
platform win32 -- Python 2.7.18[pypy-7.3.18-alpha], pytest-2.9.2, py-1.4.29, pluggy-0.3.1
hypothesis profile 'default' -> deadline=None, database=DirectoryBasedExampleDatabase('d:\\pypy_stuff\\buildbot64\\slave\\own-win-x86-64\\build\\pypy\\.hypothesis\\examples')
pytest-2.9.2 from d:\pypy_stuff\buildbot64\slave\own-win-x86-64\build\pytest.pyc
rootdir: d:\pypy_stuff\buildbot64\slave\own-win-x86-64\build, inifile: pytest.ini
plugins: hypothesis-4.39.3
collected 0 items / 1 skipped
========================== 1 skipped in 0.02 seconds ==========================
++ 03:44:44 starting module/cpyext/test/test_setobject.py [83 started in total]
__ module/cpyext/test/test_pysignals.py [80 done in total, somefailed=False] __
============================= test session starts =============================
platform win32 -- Python 2.7.18[pypy-7.3.18-alpha], pytest-2.9.2, py-1.4.29, pluggy-0.3.1
hypothesis profile 'default' -> deadline=None, database=DirectoryBasedExampleDatabase('d:\\pypy_stuff\\buildbot64\\slave\\own-win-x86-64\\build\\pypy\\.hypothesis\\examples')
pytest-2.9.2 from d:\pypy_stuff\buildbot64\slave\own-win-x86-64\build\pytest.pyc
rootdir: d:\pypy_stuff\buildbot64\slave\own-win-x86-64\build, inifile: pytest.ini
plugins: hypothesis-4.39.3
collected 0 items / 1 skipped
========================== 1 skipped in 0.01 seconds ==========================
++ 03:44:46 starting module/cpyext/test/test_sliceobject.py [84 started in total]
__ module/cpyext/test/test_pystrtod.py [81 done in total, somefailed=False] ___
============================= test session starts =============================
platform win32 -- Python 2.7.18[pypy-7.3.18-alpha], pytest-2.9.2, py-1.4.29, pluggy-0.3.1
hypothesis profile 'default' -> deadline=None, database=DirectoryBasedExampleDatabase('d:\\pypy_stuff\\buildbot64\\slave\\own-win-x86-64\\build\\pypy\\.hypothesis\\examples')
pytest-2.9.2 from d:\pypy_stuff\buildbot64\slave\own-win-x86-64\build\pytest.pyc
rootdir: d:\pypy_stuff\buildbot64\slave\own-win-x86-64\build, inifile: pytest.ini
plugins: hypothesis-4.39.3
collected 0 items / 1 skipped
========================== 1 skipped in 0.02 seconds ==========================
++ 03:44:48 starting module/cpyext/test/test_structseq.py [85 started in total]
__ module/cpyext/test/test_sequence.py [82 done in total, somefailed=False] ___
============================= test session starts =============================
platform win32 -- Python 2.7.18[pypy-7.3.18-alpha], pytest-2.9.2, py-1.4.29, pluggy-0.3.1
hypothesis profile 'default' -> deadline=None, database=DirectoryBasedExampleDatabase('d:\\pypy_stuff\\buildbot64\\slave\\own-win-x86-64\\build\\pypy\\.hypothesis\\examples')
pytest-2.9.2 from d:\pypy_stuff\buildbot64\slave\own-win-x86-64\build\pytest.pyc
rootdir: d:\pypy_stuff\buildbot64\slave\own-win-x86-64\build, inifile: pytest.ini
plugins: hypothesis-4.39.3
collected 0 items / 1 skipped
========================== 1 skipped in 0.02 seconds ==========================
++ 03:45:03 starting module/cpyext/test/test_sysmodule.py [86 started in total]
__ module/cpyext/test/test_sliceobject.py [83 done in total, somefailed=False]
============================= test session starts =============================
platform win32 -- Python 2.7.18[pypy-7.3.18-alpha], pytest-2.9.2, py-1.4.29, pluggy-0.3.1
hypothesis profile 'default' -> deadline=None, database=DirectoryBasedExampleDatabase('d:\\pypy_stuff\\buildbot64\\slave\\own-win-x86-64\\build\\pypy\\.hypothesis\\examples')
pytest-2.9.2 from d:\pypy_stuff\buildbot64\slave\own-win-x86-64\build\pytest.pyc
rootdir: d:\pypy_stuff\buildbot64\slave\own-win-x86-64\build, inifile: pytest.ini
plugins: hypothesis-4.39.3
collected 0 items / 1 skipped
========================== 1 skipped in 0.02 seconds ==========================
++ 03:45:07 starting module/cpyext/test/test_thread.py [87 started in total]
__ module/cpyext/test/test_setobject.py [84 done in total, somefailed=False] __
============================= test session starts =============================
platform win32 -- Python 2.7.18[pypy-7.3.18-alpha], pytest-2.9.2, py-1.4.29, pluggy-0.3.1
hypothesis profile 'default' -> deadline=None, database=DirectoryBasedExampleDatabase('d:\\pypy_stuff\\buildbot64\\slave\\own-win-x86-64\\build\\pypy\\.hypothesis\\examples')
pytest-2.9.2 from d:\pypy_stuff\buildbot64\slave\own-win-x86-64\build\pytest.pyc
rootdir: d:\pypy_stuff\buildbot64\slave\own-win-x86-64\build, inifile: pytest.ini
plugins: hypothesis-4.39.3
collected 0 items / 1 skipped
========================== 1 skipped in 0.02 seconds ==========================
++ 03:45:09 starting module/cpyext/test/test_traceback.py [88 started in total]
__ module/cpyext/test/test_structseq.py [85 done in total, somefailed=False] __
============================= test session starts =============================
platform win32 -- Python 2.7.18[pypy-7.3.18-alpha], pytest-2.9.2, py-1.4.29, pluggy-0.3.1
hypothesis profile 'default' -> deadline=None, database=DirectoryBasedExampleDatabase('d:\\pypy_stuff\\buildbot64\\slave\\own-win-x86-64\\build\\pypy\\.hypothesis\\examples')
pytest-2.9.2 from d:\pypy_stuff\buildbot64\slave\own-win-x86-64\build\pytest.pyc
rootdir: d:\pypy_stuff\buildbot64\slave\own-win-x86-64\build, inifile: pytest.ini
plugins: hypothesis-4.39.3
collected 0 items / 1 skipped
========================== 1 skipped in 0.02 seconds ==========================
++ 03:45:12 starting module/cpyext/test/test_translate.py [89 started in total]
__ module/cpyext/test/test_sysmodule.py [86 done in total, somefailed=False] __
============================= test session starts =============================
platform win32 -- Python 2.7.18[pypy-7.3.18-alpha], pytest-2.9.2, py-1.4.29, pluggy-0.3.1
hypothesis profile 'default' -> deadline=None, database=DirectoryBasedExampleDatabase('d:\\pypy_stuff\\buildbot64\\slave\\own-win-x86-64\\build\\pypy\\.hypothesis\\examples')
pytest-2.9.2 from d:\pypy_stuff\buildbot64\slave\own-win-x86-64\build\pytest.pyc
rootdir: d:\pypy_stuff\buildbot64\slave\own-win-x86-64\build, inifile: pytest.ini
plugins: hypothesis-4.39.3
collected 0 items / 1 skipped
========================== 1 skipped in 0.02 seconds ==========================
++ 03:45:24 starting module/cpyext/test/test_tupleobject.py [90 started in total]
__ module/cpyext/test/test_thread.py [87 done in total, somefailed=False] _____
============================= test session starts =============================
platform win32 -- Python 2.7.18[pypy-7.3.18-alpha], pytest-2.9.2, py-1.4.29, pluggy-0.3.1
hypothesis profile 'default' -> deadline=None, database=DirectoryBasedExampleDatabase('d:\\pypy_stuff\\buildbot64\\slave\\own-win-x86-64\\build\\pypy\\.hypothesis\\examples')
pytest-2.9.2 from d:\pypy_stuff\buildbot64\slave\own-win-x86-64\build\pytest.pyc
rootdir: d:\pypy_stuff\buildbot64\slave\own-win-x86-64\build, inifile: pytest.ini
plugins: hypothesis-4.39.3
collected 0 items / 1 skipped
========================== 1 skipped in 0.02 seconds ==========================
++ 03:45:28 starting module/cpyext/test/test_typeobject.py [91 started in total]
__ module/cpyext/test/test_traceback.py [88 done in total, somefailed=False] __
============================= test session starts =============================
platform win32 -- Python 2.7.18[pypy-7.3.18-alpha], pytest-2.9.2, py-1.4.29, pluggy-0.3.1
hypothesis profile 'default' -> deadline=None, database=DirectoryBasedExampleDatabase('d:\\pypy_stuff\\buildbot64\\slave\\own-win-x86-64\\build\\pypy\\.hypothesis\\examples')
pytest-2.9.2 from d:\pypy_stuff\buildbot64\slave\own-win-x86-64\build\pytest.pyc
rootdir: d:\pypy_stuff\buildbot64\slave\own-win-x86-64\build, inifile: pytest.ini
plugins: hypothesis-4.39.3
collected 0 items / 1 skipped
========================== 1 skipped in 0.02 seconds ==========================
++ 03:45:33 starting module/cpyext/test/test_unicodeobject.py [92 started in total]
__ module/cpyext/test/test_translate.py [89 done in total, somefailed=False] __
============================= test session starts =============================
platform win32 -- Python 2.7.18[pypy-7.3.18-alpha], pytest-2.9.2, py-1.4.29, pluggy-0.3.1
hypothesis profile 'default' -> deadline=None, database=DirectoryBasedExampleDatabase('d:\\pypy_stuff\\buildbot64\\slave\\own-win-x86-64\\build\\pypy\\.hypothesis\\examples')
pytest-2.9.2 from d:\pypy_stuff\buildbot64\slave\own-win-x86-64\build\pytest.pyc
rootdir: d:\pypy_stuff\buildbot64\slave\own-win-x86-64\build, inifile: pytest.ini
plugins: hypothesis-4.39.3
collected 0 items / 1 skipped
========================== 1 skipped in 0.02 seconds ==========================
++ 03:45:37 starting module/cpyext/test/test_userslots.py [93 started in total]
__ module/cpyext/test/test_tupleobject.py [90 done in total, somefailed=False]
============================= test session starts =============================
platform win32 -- Python 2.7.18[pypy-7.3.18-alpha], pytest-2.9.2, py-1.4.29, pluggy-0.3.1
hypothesis profile 'default' -> deadline=None, database=DirectoryBasedExampleDatabase('d:\\pypy_stuff\\buildbot64\\slave\\own-win-x86-64\\build\\pypy\\.hypothesis\\examples')
pytest-2.9.2 from d:\pypy_stuff\buildbot64\slave\own-win-x86-64\build\pytest.pyc
rootdir: d:\pypy_stuff\buildbot64\slave\own-win-x86-64\build, inifile: pytest.ini
plugins: hypothesis-4.39.3
collected 0 items / 1 skipped
========================== 1 skipped in 0.02 seconds ==========================
++ 03:45:49 starting module/cpyext/test/test_version.py [94 started in total]
__ module/cpyext/test/test_typeobject.py [91 done in total, somefailed=False] _
============================= test session starts =============================
platform win32 -- Python 2.7.18[pypy-7.3.18-alpha], pytest-2.9.2, py-1.4.29, pluggy-0.3.1
hypothesis profile 'default' -> deadline=None, database=DirectoryBasedExampleDatabase('d:\\pypy_stuff\\buildbot64\\slave\\own-win-x86-64\\build\\pypy\\.hypothesis\\examples')
pytest-2.9.2 from d:\pypy_stuff\buildbot64\slave\own-win-x86-64\build\pytest.pyc
rootdir: d:\pypy_stuff\buildbot64\slave\own-win-x86-64\build, inifile: pytest.ini
plugins: hypothesis-4.39.3
collected 0 items / 1 skipped
========================== 1 skipped in 0.02 seconds ==========================
++ 03:45:49 starting module/cpyext/test/test_weakref.py [95 started in total]
__ module/cpyext/test/test_unicodeobject.py [92 done in total, somefailed=False]
============================= test session starts =============================
platform win32 -- Python 2.7.18[pypy-7.3.18-alpha], pytest-2.9.2, py-1.4.29, pluggy-0.3.1
hypothesis profile 'default' -> deadline=None, database=DirectoryBasedExampleDatabase('d:\\pypy_stuff\\buildbot64\\slave\\own-win-x86-64\\build\\pypy\\.hypothesis\\examples')
pytest-2.9.2 from d:\pypy_stuff\buildbot64\slave\own-win-x86-64\build\pytest.pyc
rootdir: d:\pypy_stuff\buildbot64\slave\own-win-x86-64\build, inifile: pytest.ini
plugins: hypothesis-4.39.3
collected 0 items / 1 skipped
========================== 1 skipped in 0.02 seconds ==========================
++ 03:45:54 starting module/crypt/test [96 started in total]
__ module/crypt/test [93 done in total, somefailed=False] _____________________
============================= test session starts =============================
platform win32 -- Python 2.7.18[pypy-7.3.18-alpha], pytest-2.9.2, py-1.4.29, pluggy-0.3.1
hypothesis profile 'default' -> deadline=None, database=DirectoryBasedExampleDatabase('d:\\pypy_stuff\\buildbot64\\slave\\own-win-x86-64\\build\\pypy\\.hypothesis\\examples')
pytest-2.9.2 from d:\pypy_stuff\buildbot64\slave\own-win-x86-64\build\pytest.pyc
rootdir: d:\pypy_stuff\buildbot64\slave\own-win-x86-64\build, inifile: pytest.ini
plugins: hypothesis-4.39.3
collected 0 items / 1 skipped
========================== 1 skipped in 0.02 seconds ==========================
++ 03:45:56 starting module/errno/test [97 started in total]
__ module/cpyext/test/test_userslots.py [94 done in total, somefailed=False] __
============================= test session starts =============================
platform win32 -- Python 2.7.18[pypy-7.3.18-alpha], pytest-2.9.2, py-1.4.29, pluggy-0.3.1
hypothesis profile 'default' -> deadline=None, database=DirectoryBasedExampleDatabase('d:\\pypy_stuff\\buildbot64\\slave\\own-win-x86-64\\build\\pypy\\.hypothesis\\examples')
pytest-2.9.2 from d:\pypy_stuff\buildbot64\slave\own-win-x86-64\build\pytest.pyc
rootdir: d:\pypy_stuff\buildbot64\slave\own-win-x86-64\build, inifile: pytest.ini
plugins: hypothesis-4.39.3
collected 0 items / 1 skipped
========================== 1 skipped in 0.02 seconds ==========================
++ 03:46:01 starting module/exceptions/test [98 started in total]
__ module/errno/test [95 done in total, somefailed=False] _____________________
============================= test session starts =============================
platform win32 -- Python 2.7.18[pypy-7.3.18-alpha], pytest-2.9.2, py-1.4.29, pluggy-0.3.1
hypothesis profile 'default' -> deadline=None, database=DirectoryBasedExampleDatabase('d:\\pypy_stuff\\buildbot64\\slave\\own-win-x86-64\\build\\pypy\\.hypothesis\\examples')
pytest-2.9.2 from d:\pypy_stuff\buildbot64\slave\own-win-x86-64\build\pytest.pyc
rootdir: d:\pypy_stuff\buildbot64\slave\own-win-x86-64\build, inifile: pytest.ini
plugins: hypothesis-4.39.3
collected 3 items
module\errno\test\test_errno.py ...
========================== 3 passed in 12.42 seconds ==========================
++ 03:46:11 starting module/faulthandler/test [99 started in total]
__ module/cpyext/test/test_version.py [96 done in total, somefailed=False] ____
============================= test session starts =============================
platform win32 -- Python 2.7.18[pypy-7.3.18-alpha], pytest-2.9.2, py-1.4.29, pluggy-0.3.1
hypothesis profile 'default' -> deadline=None, database=DirectoryBasedExampleDatabase('d:\\pypy_stuff\\buildbot64\\slave\\own-win-x86-64\\build\\pypy\\.hypothesis\\examples')
pytest-2.9.2 from d:\pypy_stuff\buildbot64\slave\own-win-x86-64\build\pytest.pyc
rootdir: d:\pypy_stuff\buildbot64\slave\own-win-x86-64\build, inifile: pytest.ini
plugins: hypothesis-4.39.3
collected 0 items / 1 skipped
========================== 1 skipped in 0.02 seconds ==========================
++ 03:46:13 starting module/fcntl/test [100 started in total]
__ module/cpyext/test/test_weakref.py [97 done in total, somefailed=False] ____
============================= test session starts =============================
platform win32 -- Python 2.7.18[pypy-7.3.18-alpha], pytest-2.9.2, py-1.4.29, pluggy-0.3.1
hypothesis profile 'default' -> deadline=None, database=DirectoryBasedExampleDatabase('d:\\pypy_stuff\\buildbot64\\slave\\own-win-x86-64\\build\\pypy\\.hypothesis\\examples')
pytest-2.9.2 from d:\pypy_stuff\buildbot64\slave\own-win-x86-64\build\pytest.pyc
rootdir: d:\pypy_stuff\buildbot64\slave\own-win-x86-64\build, inifile: pytest.ini
plugins: hypothesis-4.39.3
collected 0 items / 1 skipped
========================== 1 skipped in 0.02 seconds ==========================
++ 03:46:14 starting module/gc/test [101 started in total]
__ module/fcntl/test [98 done in total, somefailed=False] _____________________
============================= test session starts =============================
platform win32 -- Python 2.7.18[pypy-7.3.18-alpha], pytest-2.9.2, py-1.4.29, pluggy-0.3.1
hypothesis profile 'default' -> deadline=None, database=DirectoryBasedExampleDatabase('d:\\pypy_stuff\\buildbot64\\slave\\own-win-x86-64\\build\\pypy\\.hypothesis\\examples')
pytest-2.9.2 from d:\pypy_stuff\buildbot64\slave\own-win-x86-64\build\pytest.pyc
rootdir: d:\pypy_stuff\buildbot64\slave\own-win-x86-64\build, inifile: pytest.ini
plugins: hypothesis-4.39.3
collected 0 items / 1 skipped
========================== 1 skipped in 1.21 seconds ==========================
++ 03:46:16 starting module/imp/test [102 started in total]
__ module/exceptions/test [99 done in total, somefailed=False] ________________
============================= test session starts =============================
platform win32 -- Python 2.7.18[pypy-7.3.18-alpha], pytest-2.9.2, py-1.4.29, pluggy-0.3.1
hypothesis profile 'default' -> deadline=None, database=DirectoryBasedExampleDatabase('d:\\pypy_stuff\\buildbot64\\slave\\own-win-x86-64\\build\\pypy\\.hypothesis\\examples')
pytest-2.9.2 from d:\pypy_stuff\buildbot64\slave\own-win-x86-64\build\pytest.pyc
rootdir: d:\pypy_stuff\buildbot64\slave\own-win-x86-64\build, inifile: pytest.ini
plugins: hypothesis-4.39.3
collected 24 items
module\exceptions\test\test_exc.py ........................
========================= 24 passed in 13.80 seconds ==========================
++ 03:46:16 starting module/itertools/test [103 started in total]
__ module/faulthandler/test [100 done in total, somefailed=False] _____________
============================= test session starts =============================
platform win32 -- Python 2.7.18[pypy-7.3.18-alpha], pytest-2.9.2, py-1.4.29, pluggy-0.3.1
hypothesis profile 'default' -> deadline=None, database=DirectoryBasedExampleDatabase('d:\\pypy_stuff\\buildbot64\\slave\\own-win-x86-64\\build\\pypy\\.hypothesis\\examples')
pytest-2.9.2 from d:\pypy_stuff\buildbot64\slave\own-win-x86-64\build\pytest.pyc
rootdir: d:\pypy_stuff\buildbot64\slave\own-win-x86-64\build, inifile: pytest.ini
plugins: hypothesis-4.39.3
collected 1 items / 1 skipped
module\faulthandler\test\test_ztranslation.py .
===================== 1 passed, 1 skipped in 7.61 seconds =====================
++ 03:46:20 starting module/marshal/test [104 started in total]
__ module/gc/test [101 done in total, somefailed=False] _______________________
============================= test session starts =============================
platform win32 -- Python 2.7.18[pypy-7.3.18-alpha], pytest-2.9.2, py-1.4.29, pluggy-0.3.1
hypothesis profile 'default' -> deadline=None, database=DirectoryBasedExampleDatabase('d:\\pypy_stuff\\buildbot64\\slave\\own-win-x86-64\\build\\pypy\\.hypothesis\\examples')
pytest-2.9.2 from d:\pypy_stuff\buildbot64\slave\own-win-x86-64\build\pytest.pyc
rootdir: d:\pypy_stuff\buildbot64\slave\own-win-x86-64\build, inifile: pytest.ini
plugins: hypothesis-4.39.3
collected 30 items
module\gc\test\test_app_referents.py ....
module\gc\test\test_gc.py .....x...
module\gc\test\test_hook.py ........
module\gc\test\test_referents.py ...s....
module\gc\test\test_ztranslation.py .
============== 28 passed, 1 skipped, 1 xfailed in 36.98 seconds ===============
++ 03:46:53 starting module/math/test [105 started in total]
__ module/marshal/test [102 done in total, somefailed=False] __________________
============================= test session starts =============================
platform win32 -- Python 2.7.18[pypy-7.3.18-alpha], pytest-2.9.2, py-1.4.29, pluggy-0.3.1
hypothesis profile 'default' -> deadline=None, database=DirectoryBasedExampleDatabase('d:\\pypy_stuff\\buildbot64\\slave\\own-win-x86-64\\build\\pypy\\.hypothesis\\examples')
pytest-2.9.2 from d:\pypy_stuff\buildbot64\slave\own-win-x86-64\build\pytest.pyc
rootdir: d:\pypy_stuff\buildbot64\slave\own-win-x86-64\build, inifile: pytest.ini
plugins: hypothesis-4.39.3
collected 80 items
module\marshal\test\test_marshal.py ...................................................................
module\marshal\test\test_marshalimpl.py .............
========================= 80 passed in 37.55 seconds ==========================
++ 03:46:59 starting module/micronumpy/test [106 started in total]
__ module/micronumpy/test [103 done in total, somefailed=False] _______________
============================= test session starts =============================
platform win32 -- Python 2.7.18[pypy-7.3.18-alpha], pytest-2.9.2, py-1.4.29, pluggy-0.3.1
hypothesis profile 'default' -> deadline=None, database=DirectoryBasedExampleDatabase('d:\\pypy_stuff\\buildbot64\\slave\\own-win-x86-64\\build\\pypy\\.hypothesis\\examples')
pytest-2.9.2 from d:\pypy_stuff\buildbot64\slave\own-win-x86-64\build\pytest.pyc
rootdir: d:\pypy_stuff\buildbot64\slave\own-win-x86-64\build, inifile: pytest.ini
plugins: hypothesis-4.39.3
collected 0 items
======================== no tests ran in 0.01 seconds =========================
++ 03:47:07 starting module/mmap/test [107 started in total]
__ module/itertools/test [104 done in total, somefailed=False] ________________
============================= test session starts =============================
platform win32 -- Python 2.7.18[pypy-7.3.18-alpha], pytest-2.9.2, py-1.4.29, pluggy-0.3.1
hypothesis profile 'default' -> deadline=None, database=DirectoryBasedExampleDatabase('d:\\pypy_stuff\\buildbot64\\slave\\own-win-x86-64\\build\\pypy\\.hypothesis\\examples')
pytest-2.9.2 from d:\pypy_stuff\buildbot64\slave\own-win-x86-64\build\pytest.pyc
rootdir: d:\pypy_stuff\buildbot64\slave\own-win-x86-64\build, inifile: pytest.ini
plugins: hypothesis-4.39.3
collected 73 items
module\itertools\test\test_itertools.py ........................................................................
module\itertools\test\test_ztranslation.py .
========================= 73 passed in 64.05 seconds ==========================
++ 03:47:24 starting module/operator/test [108 started in total]
__ module/math/test [105 done in total, somefailed=False] _____________________
============================= test session starts =============================
platform win32 -- Python 2.7.18[pypy-7.3.18-alpha], pytest-2.9.2, py-1.4.29, pluggy-0.3.1
hypothesis profile 'default' -> deadline=None, database=DirectoryBasedExampleDatabase('d:\\pypy_stuff\\buildbot64\\slave\\own-win-x86-64\\build\\pypy\\.hypothesis\\examples')
pytest-2.9.2 from d:\pypy_stuff\buildbot64\slave\own-win-x86-64\build\pytest.pyc
rootdir: d:\pypy_stuff\buildbot64\slave\own-win-x86-64\build, inifile: pytest.ini
plugins: hypothesis-4.39.3
collected 182 items
module\math\test\test_direct.py ......................................................................................................................................................................
module\math\test\test_factorial.py .s
module\math\test\test_math.py .........s....
=================== 180 passed, 2 skipped in 39.68 seconds ====================
++ 03:47:38 starting module/parser/test [109 started in total]
__ module/operator/test [106 done in total, somefailed=False] _________________
============================= test session starts =============================
platform win32 -- Python 2.7.18[pypy-7.3.18-alpha], pytest-2.9.2, py-1.4.29, pluggy-0.3.1
hypothesis profile 'default' -> deadline=None, database=DirectoryBasedExampleDatabase('d:\\pypy_stuff\\buildbot64\\slave\\own-win-x86-64\\build\\pypy\\.hypothesis\\examples')
pytest-2.9.2 from d:\pypy_stuff\buildbot64\slave\own-win-x86-64\build\pytest.pyc
rootdir: d:\pypy_stuff\buildbot64\slave\own-win-x86-64\build, inifile: pytest.ini
plugins: hypothesis-4.39.3
collected 27 items
module\operator\test\test_operator.py ..................
module\operator\test\test_tscmp.py .........
========================= 27 passed in 13.99 seconds ==========================
++ 03:47:42 starting module/posix/test [110 started in total]
__ module/mmap/test [107 done in total, somefailed=False] _____________________
============================= test session starts =============================
platform win32 -- Python 2.7.18[pypy-7.3.18-alpha], pytest-2.9.2, py-1.4.29, pluggy-0.3.1
hypothesis profile 'default' -> deadline=None, database=DirectoryBasedExampleDatabase('d:\\pypy_stuff\\buildbot64\\slave\\own-win-x86-64\\build\\pypy\\.hypothesis\\examples')
pytest-2.9.2 from d:\pypy_stuff\buildbot64\slave\own-win-x86-64\build\pytest.pyc
rootdir: d:\pypy_stuff\buildbot64\slave\own-win-x86-64\build, inifile: pytest.ini
plugins: hypothesis-4.39.3
collected 43 items
module\mmap\test\test_mmap.py ....s.................s..............ss..s.
==================== 38 passed, 5 skipped in 37.51 seconds ====================
++ 03:47:46 starting module/pwd/test [111 started in total]
__ module/pwd/test [108 done in total, somefailed=False] ______________________
============================= test session starts =============================
platform win32 -- Python 2.7.18[pypy-7.3.18-alpha], pytest-2.9.2, py-1.4.29, pluggy-0.3.1
hypothesis profile 'default' -> deadline=None, database=DirectoryBasedExampleDatabase('d:\\pypy_stuff\\buildbot64\\slave\\own-win-x86-64\\build\\pypy\\.hypothesis\\examples')
pytest-2.9.2 from d:\pypy_stuff\buildbot64\slave\own-win-x86-64\build\pytest.pyc
rootdir: d:\pypy_stuff\buildbot64\slave\own-win-x86-64\build, inifile: pytest.ini
plugins: hypothesis-4.39.3
collected 0 items / 2 skipped
========================== 2 skipped in 3.47 seconds ==========================
++ 03:47:50 starting module/pyexpat/test [112 started in total]
__ module/parser/test [109 done in total, somefailed=False] ___________________
============================= test session starts =============================
platform win32 -- Python 2.7.18[pypy-7.3.18-alpha], pytest-2.9.2, py-1.4.29, pluggy-0.3.1
hypothesis profile 'default' -> deadline=None, database=DirectoryBasedExampleDatabase('d:\\pypy_stuff\\buildbot64\\slave\\own-win-x86-64\\build\\pypy\\.hypothesis\\examples')
pytest-2.9.2 from d:\pypy_stuff\buildbot64\slave\own-win-x86-64\build\pytest.pyc
rootdir: d:\pypy_stuff\buildbot64\slave\own-win-x86-64\build, inifile: pytest.ini
plugins: hypothesis-4.39.3
collected 7 items
module\parser\test\test_parser.py .......
========================== 7 passed in 9.83 seconds ===========================
++ 03:47:51 starting module/pypyjit/test [113 started in total]
__ module/imp/test [110 done in total, somefailed=False] ______________________
============================= test session starts =============================
platform win32 -- Python 2.7.18[pypy-7.3.18-alpha], pytest-2.9.2, py-1.4.29, pluggy-0.3.1
hypothesis profile 'default' -> deadline=None, database=DirectoryBasedExampleDatabase('d:\\pypy_stuff\\buildbot64\\slave\\own-win-x86-64\\build\\pypy\\.hypothesis\\examples')
pytest-2.9.2 from d:\pypy_stuff\buildbot64\slave\own-win-x86-64\build\pytest.pyc
rootdir: d:\pypy_stuff\buildbot64\slave\own-win-x86-64\build, inifile: pytest.ini
plugins: hypothesis-4.39.3
collected 124 items
module\imp\test\test_app.py ................
module\imp\test\test_import.py ...........................................................................s............ss..................
=================== 121 passed, 3 skipped in 116.05 seconds ===================
++ 03:48:14 starting module/select/test [114 started in total]
__ module/pypyjit/test [111 done in total, somefailed=False] __________________
============================= test session starts =============================
platform win32 -- Python 2.7.18[pypy-7.3.18-alpha], pytest-2.9.2, py-1.4.29, pluggy-0.3.1
hypothesis profile 'default' -> deadline=None, database=DirectoryBasedExampleDatabase('d:\\pypy_stuff\\buildbot64\\slave\\own-win-x86-64\\build\\pypy\\.hypothesis\\examples')
pytest-2.9.2 from d:\pypy_stuff\buildbot64\slave\own-win-x86-64\build\pytest.pyc
rootdir: d:\pypy_stuff\buildbot64\slave\own-win-x86-64\build, inifile: pytest.ini
plugins: hypothesis-4.39.3
collected 29 items
module\pypyjit\test\test_jit_hook.py ........s
module\pypyjit\test\test_jit_not_in_trace.py ..
module\pypyjit\test\test_jit_setup.py ....
module\pypyjit\test\test_policy.py ............
module\pypyjit\test\test_pyframe.py .
module\pypyjit\test\test_ztranslation.py .
==================== 28 passed, 1 skipped in 31.78 seconds ====================
++ 03:48:25 starting module/signal/test [115 started in total]
__ module/pyexpat/test [112 done in total, somefailed=False] __________________
============================= test session starts =============================
platform win32 -- Python 2.7.18[pypy-7.3.18-alpha], pytest-2.9.2, py-1.4.29, pluggy-0.3.1
hypothesis profile 'default' -> deadline=None, database=DirectoryBasedExampleDatabase('d:\\pypy_stuff\\buildbot64\\slave\\own-win-x86-64\\build\\pypy\\.hypothesis\\examples')
pytest-2.9.2 from d:\pypy_stuff\buildbot64\slave\own-win-x86-64\build\pytest.pyc
rootdir: d:\pypy_stuff\buildbot64\slave\own-win-x86-64\build, inifile: pytest.ini
plugins: hypothesis-4.39.3
collected 21 items
module\pyexpat\test\test_build.py .
module\pyexpat\test\test_parser.py ..................ss
==================== 19 passed, 2 skipped in 50.35 seconds ====================
++ 03:48:43 starting module/struct/test [116 started in total]
__ module/signal/test [113 done in total, somefailed=False] ___________________
============================= test session starts =============================
platform win32 -- Python 2.7.18[pypy-7.3.18-alpha], pytest-2.9.2, py-1.4.29, pluggy-0.3.1
hypothesis profile 'default' -> deadline=None, database=DirectoryBasedExampleDatabase('d:\\pypy_stuff\\buildbot64\\slave\\own-win-x86-64\\build\\pypy\\.hypothesis\\examples')
pytest-2.9.2 from d:\pypy_stuff\buildbot64\slave\own-win-x86-64\build\pytest.pyc
rootdir: d:\pypy_stuff\buildbot64\slave\own-win-x86-64\build, inifile: pytest.ini
plugins: hypothesis-4.39.3
collected 18 items
module\signal\test\test_signal.py s.s.....ss.s.sss..
==================== 10 passed, 8 skipped in 48.31 seconds ====================
++ 03:49:17 starting module/sys/test [117 started in total]
__ module/posix/test [114 done in total, somefailed=False] ____________________
============================= test session starts =============================
platform win32 -- Python 2.7.18[pypy-7.3.18-alpha], pytest-2.9.2, py-1.4.29, pluggy-0.3.1
hypothesis profile 'default' -> deadline=None, database=DirectoryBasedExampleDatabase('d:\\pypy_stuff\\buildbot64\\slave\\own-win-x86-64\\build\\pypy\\.hypothesis\\examples')
pytest-2.9.2 from d:\pypy_stuff\buildbot64\slave\own-win-x86-64\build\pytest.pyc
rootdir: d:\pypy_stuff\buildbot64\slave\own-win-x86-64\build, inifile: pytest.ini
plugins: hypothesis-4.39.3
collected 59 items
module\posix\test\test_posix2.py ................s...............s...........s....sss.s
module\posix\test\test_posix_libfile.py ..ss
module\posix\test\test_ztranslation.py .
==================== 50 passed, 9 skipped in 90.87 seconds ====================
++ 03:49:18 starting module/termios/test [118 started in total]
__ module/termios/test [115 done in total, somefailed=False] __________________
============================= test session starts =============================
platform win32 -- Python 2.7.18[pypy-7.3.18-alpha], pytest-2.9.2, py-1.4.29, pluggy-0.3.1
hypothesis profile 'default' -> deadline=None, database=DirectoryBasedExampleDatabase('d:\\pypy_stuff\\buildbot64\\slave\\own-win-x86-64\\build\\pypy\\.hypothesis\\examples')
pytest-2.9.2 from d:\pypy_stuff\buildbot64\slave\own-win-x86-64\build\pytest.pyc
rootdir: d:\pypy_stuff\buildbot64\slave\own-win-x86-64\build, inifile: pytest.ini
plugins: hypothesis-4.39.3
collected 0 items / 1 skipped
========================== 1 skipped in 3.48 seconds ==========================
++ 03:49:24 starting module/test_lib_pypy [119 started in total]
__ module/struct/test [116 done in total, somefailed=False] ___________________
============================= test session starts =============================
platform win32 -- Python 2.7.18[pypy-7.3.18-alpha], pytest-2.9.2, py-1.4.29, pluggy-0.3.1
hypothesis profile 'default' -> deadline=None, database=DirectoryBasedExampleDatabase('d:\\pypy_stuff\\buildbot64\\slave\\own-win-x86-64\\build\\pypy\\.hypothesis\\examples')
pytest-2.9.2 from d:\pypy_stuff\buildbot64\slave\own-win-x86-64\build\pytest.pyc
rootdir: d:\pypy_stuff\buildbot64\slave\own-win-x86-64\build, inifile: pytest.ini
plugins: hypothesis-4.39.3
collected 41 items
module\struct\test\test_struct.py ........................................
module\struct\test\test_ztranslation.py .
========================= 41 passed in 58.45 seconds ==========================
++ 03:49:43 starting module/thread/test [120 started in total]
__ module/select/test [117 done in total, somefailed=False] ___________________
============================= test session starts =============================
platform win32 -- Python 2.7.18[pypy-7.3.18-alpha], pytest-2.9.2, py-1.4.29, pluggy-0.3.1
hypothesis profile 'default' -> deadline=None, database=DirectoryBasedExampleDatabase('d:\\pypy_stuff\\buildbot64\\slave\\own-win-x86-64\\build\\pypy\\.hypothesis\\examples')
pytest-2.9.2 from d:\pypy_stuff\buildbot64\slave\own-win-x86-64\build\pytest.pyc
rootdir: d:\pypy_stuff\buildbot64\slave\own-win-x86-64\build, inifile: pytest.ini
plugins: hypothesis-4.39.3
collected 41 items
module\select\test\test_epoll.py ssssssss
module\select\test\test_kqueue.py sssss
module\select\test\test_select.py sssssssssssssss..........ss
module\select\test\test_ztranslation.py .
=================== 11 passed, 30 skipped in 135.93 seconds ===================
++ 03:50:34 starting module/time/test [121 started in total]
__ module/test_lib_pypy [118 done in total, somefailed=False] _________________
============================= test session starts =============================
platform win32 -- Python 2.7.18[pypy-7.3.18-alpha], pytest-2.9.2, py-1.4.29, pluggy-0.3.1
hypothesis profile 'default' -> deadline=None, database=DirectoryBasedExampleDatabase('d:\\pypy_stuff\\buildbot64\\slave\\own-win-x86-64\\build\\pypy\\.hypothesis\\examples')
pytest-2.9.2 from d:\pypy_stuff\buildbot64\slave\own-win-x86-64\build\pytest.pyc
rootdir: d:\pypy_stuff\buildbot64\slave\own-win-x86-64\build, inifile: pytest.ini
plugins: hypothesis-4.39.3
collected 232 items / 5 skipped
module\test_lib_pypy\test_collections.py .....................
module\test_lib_pypy\test_marshal_extra.py .......................................................................................................................................................
module\test_lib_pypy\test_md5_extra.py ......
module\test_lib_pypy\test_msvcrt.py .
module\test_lib_pypy\test_pickle_extra.py s
module\test_lib_pypy\test_sha_extra.py ...
module\test_lib_pypy\test_site_extra.py .
module\test_lib_pypy\test_stackless.py ..............................
module\test_lib_pypy\test_stackless_pickling.py ..
module\test_lib_pypy\test_structseq.py .........
module\test_lib_pypy\test_tputil.py ..s....
=================== 230 passed, 7 skipped in 77.99 seconds ====================
++ 03:50:46 starting module/unicodedata/test [122 started in total]
__ module/sys/test [119 done in total, somefailed=True] _______________________
============================= test session starts =============================
platform win32 -- Python 2.7.18[pypy-7.3.18-alpha], pytest-2.9.2, py-1.4.29, pluggy-0.3.1
hypothesis profile 'default' -> deadline=None, database=DirectoryBasedExampleDatabase('d:\\pypy_stuff\\buildbot64\\slave\\own-win-x86-64\\build\\pypy\\.hypothesis\\examples')
pytest-2.9.2 from d:\pypy_stuff\buildbot64\slave\own-win-x86-64\build\pytest.pyc
rootdir: d:\pypy_stuff\buildbot64\slave\own-win-x86-64\build, inifile: pytest.ini
plugins: hypothesis-4.39.3
[platform:msg] Updated environment with vsver 160, using x64 True
[platform:msg] Updated environment with vsver 160, using x64 True
collected 65 items
module\sys\test\apptest_initpath.py F
module\sys\test\test_encoding.py s
module\sys\test\test_initpath.py .s.....
module\sys\test\test_sysmodule.py ..............................ss....................
module\sys\test\test_version.py ....
================================== FAILURES ===================================
__________________________ test_pypy_find_executable __________________________
def test_pypy_find_executable():
# issue #4003
import sys
executable = sys.pypy_find_executable('*')
if sys.platform == 'win32':
> assert executable.endswith('.exe')
E (application-level) AssertionError: assert False
E + where False = <bound method str.endswith of ''>('.exe')
E + where <bound method str.endswith of ''> = ''.endswith
module\sys\test\apptest_initpath.py:9: AssertionError
=========================== short test summary info ===========================
FAIL module\sys\test\apptest_initpath.py::test_pypy_find_executable
=============== 1 failed, 60 passed, 4 skipped in 88.46 seconds ===============
++ 03:50:54 starting module/zipimport/test [123 started in total]
__ module/unicodedata/test [120 done in total, somefailed=False] ______________
============================= test session starts =============================
platform win32 -- Python 2.7.18[pypy-7.3.18-alpha], pytest-2.9.2, py-1.4.29, pluggy-0.3.1
hypothesis profile 'default' -> deadline=None, database=DirectoryBasedExampleDatabase('d:\\pypy_stuff\\buildbot64\\slave\\own-win-x86-64\\build\\pypy\\.hypothesis\\examples')
pytest-2.9.2 from d:\pypy_stuff\buildbot64\slave\own-win-x86-64\build\pytest.pyc
rootdir: d:\pypy_stuff\buildbot64\slave\own-win-x86-64\build, inifile: pytest.ini
plugins: hypothesis-4.39.3
collected 26 items
module\unicodedata\test\test_hyp.py ................
module\unicodedata\test\test_unicodedata.py ..........
========================= 26 passed in 33.57 seconds ==========================
++ 03:51:25 starting module/zlib/test [124 started in total]
__ module/time/test [121 done in total, somefailed=False] _____________________
============================= test session starts =============================
platform win32 -- Python 2.7.18[pypy-7.3.18-alpha], pytest-2.9.2, py-1.4.29, pluggy-0.3.1
hypothesis profile 'default' -> deadline=None, database=DirectoryBasedExampleDatabase('d:\\pypy_stuff\\buildbot64\\slave\\own-win-x86-64\\build\\pypy\\.hypothesis\\examples')
pytest-2.9.2 from d:\pypy_stuff\buildbot64\slave\own-win-x86-64\build\pytest.pyc
rootdir: d:\pypy_stuff\buildbot64\slave\own-win-x86-64\build, inifile: pytest.ini
plugins: hypothesis-4.39.3
collected 18 items
module\time\test\test_time.py ...........s......
==================== 17 passed, 1 skipped in 55.54 seconds ====================
++ 03:51:34 starting objspace/fake/test [125 started in total]
__ module/zlib/test [122 done in total, somefailed=False] _____________________
============================= test session starts =============================
platform win32 -- Python 2.7.18[pypy-7.3.18-alpha], pytest-2.9.2, py-1.4.29, pluggy-0.3.1
hypothesis profile 'default' -> deadline=None, database=DirectoryBasedExampleDatabase('d:\\pypy_stuff\\buildbot64\\slave\\own-win-x86-64\\build\\pypy\\.hypothesis\\examples')
pytest-2.9.2 from d:\pypy_stuff\buildbot64\slave\own-win-x86-64\build\pytest.pyc
rootdir: d:\pypy_stuff\buildbot64\slave\own-win-x86-64\build, inifile: pytest.ini
plugins: hypothesis-4.39.3
collected 31 items
module\zlib\test\test_zlib.py ...............................
========================= 31 passed in 25.93 seconds ==========================
++ 03:51:55 starting objspace/std/test [126 started in total]
__ objspace/fake/test [123 done in total, somefailed=False] ___________________
============================= test session starts =============================
platform win32 -- Python 2.7.18[pypy-7.3.18-alpha], pytest-2.9.2, py-1.4.29, pluggy-0.3.1
hypothesis profile 'default' -> deadline=None, database=DirectoryBasedExampleDatabase('d:\\pypy_stuff\\buildbot64\\slave\\own-win-x86-64\\build\\pypy\\.hypothesis\\examples')
pytest-2.9.2 from d:\pypy_stuff\buildbot64\slave\own-win-x86-64\build\pytest.pyc
rootdir: d:\pypy_stuff\buildbot64\slave\own-win-x86-64\build, inifile: pytest.ini
plugins: hypothesis-4.39.3
collected 21 items
objspace\fake\test\test_checkmodule.py ........
objspace\fake\test\test_objspace.py .............
========================= 21 passed in 94.79 seconds ==========================
++ 03:53:18 starting objspace/test [127 started in total]
__ module/zipimport/test [124 done in total, somefailed=False] ________________
============================= test session starts =============================
platform win32 -- Python 2.7.18[pypy-7.3.18-alpha], pytest-2.9.2, py-1.4.29, pluggy-0.3.1
hypothesis profile 'default' -> deadline=None, database=DirectoryBasedExampleDatabase('d:\\pypy_stuff\\buildbot64\\slave\\own-win-x86-64\\build\\pypy\\.hypothesis\\examples')
pytest-2.9.2 from d:\pypy_stuff\buildbot64\slave\own-win-x86-64\build\pytest.pyc
rootdir: d:\pypy_stuff\buildbot64\slave\own-win-x86-64\build, inifile: pytest.ini
plugins: hypothesis-4.39.3
collected 67 items
module\zipimport\test\test_undocumented.py ......
module\zipimport\test\test_zipimport.py ........................................
module\zipimport\test\test_zipimport_deflated.py .....................
========================= 67 passed in 150.02 seconds =========================
++ 03:53:29 starting sandbox/test [128 started in total]
__ sandbox/test [125 done in total, somefailed=False] _________________________
============================= test session starts =============================
platform win32 -- Python 2.7.18[pypy-7.3.18-alpha], pytest-2.9.2, py-1.4.29, pluggy-0.3.1
hypothesis profile 'default' -> deadline=None, database=DirectoryBasedExampleDatabase('d:\\pypy_stuff\\buildbot64\\slave\\own-win-x86-64\\build\\pypy\\.hypothesis\\examples')
pytest-2.9.2 from d:\pypy_stuff\buildbot64\slave\own-win-x86-64\build\pytest.pyc
rootdir: d:\pypy_stuff\buildbot64\slave\own-win-x86-64\build, inifile: pytest.ini
plugins: hypothesis-4.39.3
collected 0 items / 1 skipped
========================== 1 skipped in 7.03 seconds ==========================
++ 03:53:38 starting tool/bench/test [129 started in total]
__ tool/bench/test [126 done in total, somefailed=False] ______________________
============================= test session starts =============================
platform win32 -- Python 2.7.18[pypy-7.3.18-alpha], pytest-2.9.2, py-1.4.29, pluggy-0.3.1
hypothesis profile 'default' -> deadline=None, database=DirectoryBasedExampleDatabase('d:\\pypy_stuff\\buildbot64\\slave\\own-win-x86-64\\build\\pypy\\.hypothesis\\examples')
pytest-2.9.2 from d:\pypy_stuff\buildbot64\slave\own-win-x86-64\build\pytest.pyc
rootdir: d:\pypy_stuff\buildbot64\slave\own-win-x86-64\build, inifile: pytest.ini
plugins: hypothesis-4.39.3
collected 3 items / 1 skipped
[platform:msg] Updated environment with vsver 160, using x64 True
[platform:msg] Updated environment with vsver 160, using x64 True
tool\bench\test\test_pypyresult.py ...
===================== 3 passed, 1 skipped in 9.24 seconds =====================
++ 03:53:49 starting tool/memusage/test [130 started in total]
__ objspace/test [127 done in total, somefailed=False] ________________________
============================= test session starts =============================
platform win32 -- Python 2.7.18[pypy-7.3.18-alpha], pytest-2.9.2, py-1.4.29, pluggy-0.3.1
hypothesis profile 'default' -> deadline=None, database=DirectoryBasedExampleDatabase('d:\\pypy_stuff\\buildbot64\\slave\\own-win-x86-64\\build\\pypy\\.hypothesis\\examples')
pytest-2.9.2 from d:\pypy_stuff\buildbot64\slave\own-win-x86-64\build\pytest.pyc
rootdir: d:\pypy_stuff\buildbot64\slave\own-win-x86-64\build, inifile: pytest.ini
plugins: hypothesis-4.39.3
[platform:msg] Updated environment with vsver 160, using x64 True
[platform:msg] Updated environment with vsver 160, using x64 True
collected 59 items
objspace\test\apptest_binop_overriding.py .
objspace\test\apptest_descriptor.py ........
objspace\test\apptest_descroperation.py ............s..........................
objspace\test\test_descroperation.py ...........
==================== 58 passed, 1 skipped in 28.01 seconds ====================
++ 03:53:52 starting tool/pytest/test [131 started in total]
__ tool/memusage/test [128 done in total, somefailed=False] ___________________
============================= test session starts =============================
platform win32 -- Python 2.7.18[pypy-7.3.18-alpha], pytest-2.9.2, py-1.4.29, pluggy-0.3.1
hypothesis profile 'default' -> deadline=None, database=DirectoryBasedExampleDatabase('d:\\pypy_stuff\\buildbot64\\slave\\own-win-x86-64\\build\\pypy\\.hypothesis\\examples')
pytest-2.9.2 from d:\pypy_stuff\buildbot64\slave\own-win-x86-64\build\pytest.pyc
rootdir: d:\pypy_stuff\buildbot64\slave\own-win-x86-64\build, inifile: pytest.ini
plugins: hypothesis-4.39.3
collected 5 items
[platform:msg] Updated environment with vsver 160, using x64 True
[platform:msg] Updated environment with vsver 160, using x64 True
tool\memusage\test\test_log2gnumeric.py .....
========================== 5 passed in 3.25 seconds ===========================
++ 03:53:54 starting tool/release/test [132 started in total]
__ module/thread/test [129 done in total, somefailed=False] ___________________
============================= test session starts =============================
platform win32 -- Python 2.7.18[pypy-7.3.18-alpha], pytest-2.9.2, py-1.4.29, pluggy-0.3.1
hypothesis profile 'default' -> deadline=None, database=DirectoryBasedExampleDatabase('d:\\pypy_stuff\\buildbot64\\slave\\own-win-x86-64\\build\\pypy\\.hypothesis\\examples')
pytest-2.9.2 from d:\pypy_stuff\buildbot64\slave\own-win-x86-64\build\pytest.pyc
rootdir: d:\pypy_stuff\buildbot64\slave\own-win-x86-64\build, inifile: pytest.ini
plugins: hypothesis-4.39.3
collected 48 items
module\thread\test\test_fork.py sss
module\thread\test\test_gil.py ....
module\thread\test\test_import_lock.py .....
module\thread\test\test_local.py .......
module\thread\test\test_lock.py .............sss.
module\thread\test\test_thread.py ..........s.
=================== 41 passed, 7 skipped in 263.14 seconds ====================
++ 03:54:13 starting tool/test [133 started in total]
__ tool/release/test [130 done in total, somefailed=False] ____________________
============================= test session starts =============================
platform win32 -- Python 2.7.18[pypy-7.3.18-alpha], pytest-2.9.2, py-1.4.29, pluggy-0.3.1
hypothesis profile 'default' -> deadline=None, database=DirectoryBasedExampleDatabase('d:\\pypy_stuff\\buildbot64\\slave\\own-win-x86-64\\build\\pypy\\.hypothesis\\examples')
pytest-2.9.2 from d:\pypy_stuff\buildbot64\slave\own-win-x86-64\build\pytest.pyc
rootdir: d:\pypy_stuff\buildbot64\slave\own-win-x86-64\build, inifile: pytest.ini
plugins: hypothesis-4.39.3
collected 8 items
tool\release\test\test_package.py ...ss
tool\release\test\test_smartstrip.py sss
==================== 3 passed, 5 skipped in 40.12 seconds =====================
__ tool/test [131 done in total, somefailed=False] ____________________________
============================= test session starts =============================
platform win32 -- Python 2.7.18[pypy-7.3.18-alpha], pytest-2.9.2, py-1.4.29, pluggy-0.3.1
hypothesis profile 'default' -> deadline=None, database=DirectoryBasedExampleDatabase('d:\\pypy_stuff\\buildbot64\\slave\\own-win-x86-64\\build\\pypy\\.hypothesis\\examples')
pytest-2.9.2 from d:\pypy_stuff\buildbot64\slave\own-win-x86-64\build\pytest.pyc
rootdir: d:\pypy_stuff\buildbot64\slave\own-win-x86-64\build, inifile: pytest.ini
plugins: hypothesis-4.39.3
collected 29 items
tool\test\test_gdb_pypy.py ...........
tool\test\test_getdocstrings.py ...
tool\test\test_isolate.py .......
tool\test\test_lib_pypy.py ...
tool\test\test_license.py .
tool\test\test_package.py .
tool\test\test_tab.py ..
tool\test\test_template.py .
========================= 29 passed in 32.30 seconds ==========================
__ tool/pytest/test [132 done in total, somefailed=False] _____________________
============================= test session starts =============================
platform win32 -- Python 2.7.18[pypy-7.3.18-alpha], pytest-2.9.2, py-1.4.29, pluggy-0.3.1
hypothesis profile 'default' -> deadline=None, database=DirectoryBasedExampleDatabase('d:\\pypy_stuff\\buildbot64\\slave\\own-win-x86-64\\build\\pypy\\.hypothesis\\examples')
pytest-2.9.2 from d:\pypy_stuff\buildbot64\slave\own-win-x86-64\build\pytest.pyc
rootdir: d:\pypy_stuff\buildbot64\slave\own-win-x86-64\build, inifile: pytest.ini
plugins: hypothesis-4.39.3
collected 24 items
tool\pytest\test\test_appsupport.py .........
tool\pytest\test\test_astrewrite.py .....
tool\pytest\test\test_conftest1.py ..
tool\pytest\test\test_pytestsupport.py ........
========================= 24 passed in 106.61 seconds =========================
__ objspace/std/test [133 done in total, somefailed=False] ____________________
============================= test session starts =============================
platform win32 -- Python 2.7.18[pypy-7.3.18-alpha], pytest-2.9.2, py-1.4.29, pluggy-0.3.1
hypothesis profile 'default' -> deadline=None, database=DirectoryBasedExampleDatabase('d:\\pypy_stuff\\buildbot64\\slave\\own-win-x86-64\\build\\pypy\\.hypothesis\\examples')
pytest-2.9.2 from d:\pypy_stuff\buildbot64\slave\own-win-x86-64\build\pytest.pyc
rootdir: d:\pypy_stuff\buildbot64\slave\own-win-x86-64\build, inifile: pytest.ini
plugins: hypothesis-4.39.3
[platform:msg] Updated environment with vsver 160, using x64 True
[platform:msg] Updated environment with vsver 160, using x64 True
collected 2132 items
objspace\std\test\apptest_boolobject.py ........
objspace\std\test\apptest_bufferobject.py ...............
objspace\std\test\apptest_callmethod.py ........
objspace\std\test\apptest_complexobject.py ...............................
objspace\std\test\apptest_instmethobject.py .....
objspace\std\test\apptest_iterobject.py ..............
objspace\std\test\apptest_operation.py ...
objspace\std\test\apptest_stringformat.py ...............s...........................s........
objspace\std\test\apptest_userobject.py ......................
objspace\std\test\test_boolobject.py .......
objspace\std\test\test_bytearrayobject.py .......................................................
objspace\std\test\test_bytesobject.py ......................................................................s.......
objspace\std\test\test_callmethod.py ...
objspace\std\test\test_celldict.py .......................................
objspace\std\test\test_complexobject.py ....
objspace\std\test\test_dictmultiobject.py ...........s.....................................................................................................................................................................
objspace\std\test\test_dictproxy.py ..........
objspace\std\test\test_floatobject.py ......................................
objspace\std\test\test_identitydict.py ......
objspace\std\test\test_identityset.py .......
objspace\std\test\test_index.py ..............................................
objspace\std\test\test_intobject.py .........................s..................................s........................................s...............
objspace\std\test\test_iterobject.py ....
objspace\std\test\test_jsondict.py ...........
objspace\std\test\test_kwargsdict.py ....................................
objspace\std\test\test_lengthhint.py ....................
objspace\std\test\test_listobject.py .......................................................................................................................
objspace\std\test\test_liststrategies.py ...................................................................s..................................................................
objspace\std\test\test_longobject.py .........................................
objspace\std\test\test_mapdict.py ...............................................................................................................................................
objspace\std\test\test_memoryobject.py .......
objspace\std\test\test_methodcache.py .......................................................................
objspace\std\test\test_newformat.py .......................................................................................s........
objspace\std\test\test_noneobject.py ...
objspace\std\test\test_obj.py .......................
objspace\std\test\test_prebuiltint.py ...........................s...............
objspace\std\test\test_proxy.py ssssssssssss
objspace\std\test\test_proxy_function.py ........
objspace\std\test\test_proxy_internals.py ........
objspace\std\test\test_proxy_iter.py .
objspace\std\test\test_proxy_object.py ..........
objspace\std\test\test_proxy_usercreated.py .
objspace\std\test\test_random_attr.py .....
objspace\std\test\test_setobject.py ....................................................................................
objspace\std\test\test_setstrategies.py ....s...ss..
objspace\std\test\test_sliceobject.py ............
objspace\std\test\test_smalllongobject.py .........................s..................................s.....................................................................................s..................................s..............
objspace\std\test\test_specialisedtupleobject.py ..................ss.......................
objspace\std\test\test_stdobjspace.py s......
objspace\std\test\test_tupleobject.py ...................................
objspace\std\test\test_typeobject.py ..............................................................................
objspace\std\test\test_unicodeobject.py .................................s........................................................s.................
objspace\std\test\test_userobject.py .
objspace\std\test\test_versionedtype.py ...............
================== 2098 passed, 34 skipped in 241.00 seconds ==================
program finished with exit code 1
elapsedTime=1648.764000