Home - Summaries: (main) : (py3.11) : (py3.12) : Everything - Nightly builds - Benchmarks - RPython - Builders - About

Branch: jit-nonneg-fields

Build Revision Builder Started Result
817* 6d6f0980fe68* rpython-macos-x86-64 2026-09-02 15:06 OK
817* 6d6f0980fe68* rpython-linux-aarch64 2026-09-02 14:54 OK
817* 6d6f0980fe68* rpython-linux-x86-32 2026-09-02 14:54 OK
817* 6d6f0980fe68* rpython-linux-x86-64 2026-09-02 14:54 OK
817* 6d6f0980fe68* rpython-macos-arm64 2026-09-02 14:54 OK
817* 6d6f0980fe68* rpython-win-x86-64 2026-09-02 14:54 FAILED
815* 515a4d02d07b* rpython-linux-aarch64 2026-09-01 15:15 FAILED
815* 515a4d02d07b* rpython-macos-arm64 2026-09-01 14:58 FAILED
815* 515a4d02d07b* rpython-macos-x86-64 2026-09-01 14:58 OK
815* 515a4d02d07b* rpython-linux-x86-32 2026-09-01 14:58 OK
815* 515a4d02d07b* rpython-linux-x86-64 2026-09-01 14:58 OK
815* 515a4d02d07b* rpython-win-x86-64 2026-09-01 14:58 FAILED
814* da949012a659* rpython-linux-aarch64 2026-09-01 14:10 FAILED
814* da949012a659* rpython-linux-x86-32 2026-09-01 14:09 FAILED
814* da949012a659* rpython-linux-x86-64 2026-09-01 14:06 FAILED
814* da949012a659* rpython-macos-x86-64 2026-09-01 13:57 exception
814* da949012a659* rpython-win-x86-64 2026-09-01 13:57 FAILED
814* da949012a659* rpython-macos-arm64 2026-09-01 13:57 exception
11861+ e13b1d74a051+ pypy-c-jit-linux-x86-64 2026-07-10 09:24 FAILED
8381+ 6c7fdc31fe51+ pypy-c-jit-linux-x86-32 2026-07-10 09:24 FAILED
922+ 6c7fdc31fe51+ rpython-linux-x86-64 2026-07-10 09:24 FAILED
861+ 6c7fdc31fe51+ rpython-linux-x86-32 2026-07-10 09:24 FAILED
11850+ 6c7fdc31fe51+ pypy-c-jit-linux-x86-64 2026-07-07 08:14 FAILED
8373+ 6c7fdc31fe51+ pypy-c-jit-linux-x86-32 2026-07-07 08:14 FAILED
919+ 6c7fdc31fe51+ rpython-linux-x86-64 2026-07-07 08:14 FAILED
858+ 6c7fdc31fe51+ rpython-linux-x86-32 2026-07-07 08:14 FAILED