Home - Summaries: (main) : (py3.11) : (py3.12) : Everything - Nightly builds - Benchmarks - RPython - Builders - About

Branch: freelist-enter_code

Build Revision Builder Started Result
783* 0f03581ce5ed* rpython-macos-x86-64 2026-08-25 07:28 FAILED
783* 0f03581ce5ed* rpython-linux-aarch64 2026-08-25 07:18 OK
783* 0f03581ce5ed* rpython-linux-x86-32 2026-08-25 07:18 OK
783* 0f03581ce5ed* rpython-linux-x86-64 2026-08-25 07:18 OK
783* 0f03581ce5ed* rpython-macos-arm64 2026-08-25 07:18 FAILED
783* 0f03581ce5ed* rpython-win-x86-64 2026-08-25 07:18 FAILED
782* 50ff8e211cc6* rpython-linux-aarch64 2026-08-25 04:45 FAILED
782* 50ff8e211cc6* rpython-linux-x86-64 2026-08-25 04:45 FAILED
782* 50ff8e211cc6* rpython-macos-x86-64 2026-08-25 04:45 FAILED
782* 50ff8e211cc6* rpython-linux-x86-32 2026-08-25 04:45 OK
782* 50ff8e211cc6* rpython-macos-arm64 2026-08-25 04:45 FAILED
782* 50ff8e211cc6* rpython-win-x86-64 2026-08-25 04:45 FAILED
781* 59e1739a396e* rpython-macos-arm64 2026-08-24 20:57 FAILED
781* 59e1739a396e* rpython-linux-aarch64 2026-08-24 20:43 FAILED
781* 59e1739a396e* rpython-linux-x86-32 2026-08-24 20:43 FAILED
781* 59e1739a396e* rpython-linux-x86-64 2026-08-24 20:43 FAILED
781* 59e1739a396e* rpython-macos-x86-64 2026-08-24 20:43 FAILED
781* 59e1739a396e* rpython-win-x86-64 2026-08-24 20:43 FAILED